program: Gaussian 09
title: 000173587
version: EM64L-G09RevD.01
frameworkgroup: C1[X(C26H25N3O5S)]
method: RPBEPBE
basis: SDD
operation: Freq
keyword: #p
keyword: freq=noraman
keyword: PBEPBE/SDD
title: #p freq=noraman PBEPBE/SDD
converged: NO YES NO NO
title: Mulliken charges:
elementType: S O O O O O N N N C C C C C C C C C C C C C C C C C C C C C C C C C C H H H H H H H H H H H H H H H H H H H H H H H H H
charge: 0.187690 -0.170992 -0.414594 -0.194752 -0.273255 -0.210660 -0.104151 -0.383756 -0.049662 -0.462483 -0.142544 -0.091342 -0.168309 0.106678 -0.653461 -0.689191 0.154261 0.184579 -0.169625 0.191112 -0.529435 0.256757 0.470810 0.496307 -0.801234 -0.416657 -0.436023 -0.398666 -0.355518 -0.232231 -0.231334 -0.239014 -0.234924 -0.244879 -0.243659 0.318037 0.291303 0.313058 0.253604 0.242702 0.224400 0.231729 0.236585 0.245610 0.333062 0.389070 0.284450 0.247113 0.266691 0.272210 0.237807 0.242054 0.269819 0.246262 0.225116 0.223485 0.225104 0.222139 0.227278 0.225466
chargesum: 0.00000
title: Mulliken charges with hydrogens summed into heavy atoms:
elementType: S O O O O O N N N C C C C C C C C C C C C C C C C C C C C C C C C C C
charge: 0.187690 -0.170992 -0.025524 -0.194752 -0.273255 -0.210660 -0.104151 -0.050694 -0.049662 -0.144446 -0.142544 0.199961 0.144750 0.106678 0.067246 0.024734 0.154261 0.184579 -0.169625 0.191112 -0.244985 0.256757 0.470810 0.496307 -0.015220 -0.178850 -0.193969 -0.128847 -0.109256 -0.007115 -0.007849 -0.013910 -0.012785 -0.017601 -0.018192
polarizability: 4.02758773e+02 1.66549781e+01 3.02704320e+02 6.99340533e+00 9.51469307e+00 2.82270311e+02
1716.lowfreq: -13.7814 -4.6381 -4.1612 -1.1572 -0.0011 -0.0008 -0.0005 9.2425 13.8448
frequency: -6.5018 -2.9114 13.6110 18.4757 26.5612 35.5415 39.2608 47.8838 53.4210 57.7763 62.6981 72.6606 87.8642 101.1927 113.8309 126.7423 133.3846 147.1392 184.5461 197.4372 209.3058 222.2258 230.5844 233.0638 239.5092 247.2298 258.3955 274.8643 280.5874 291.8218 296.1641 301.0023 338.9564 352.6269 359.6545 366.9415 390.5249 401.8317 406.3687 432.5703 478.0097 479.8984 485.1708 495.9773 516.8739 526.3292 569.0608 578.8232 583.5917 607.7030 611.4932 614.5359 615.9514 621.2378 625.7385 642.3400 660.3309 692.3486 699.5531 702.5834 708.8262 713.8348 733.0213 758.1276 762.3420 770.4182 779.6187 786.8890 824.8150 833.5855 843.5712 850.4397 856.6334 860.8349 865.0082 903.5026 926.5128 933.6071 935.1387 942.0328 944.0454 952.9953 974.6724 984.2254 990.2113 990.8197 991.8778 993.2276 999.0381 1007.7342 1022.7209 1028.5755 1030.9486 1036.1224 1043.8627 1064.1314 1080.9256 1084.6944 1087.9984 1124.2788 1150.4390 1164.7532 1170.9809 1171.9993 1176.2707 1183.9414 1190.9697 1194.3241 1195.2226 1201.2834 1206.1777 1215.3464 1219.6274 1236.6499 1247.1343 1270.1991 1273.9558 1281.7123 1300.4423 1321.6373 1343.1971 1346.9936 1359.1248 1379.8928 1385.6991 1388.9108 1403.8654 1406.4366 1415.6363 1431.2532 1444.4754 1445.6458 1458.2930 1463.0753 1463.3443 1469.0281 1478.2496 1478.4996 1480.2161 1481.4918 1482.6120 1559.7515 1592.1331 1595.3799 1609.2625 1613.3321 1615.0978 1681.6323 1729.2322 2983.4837 2983.7824 2988.0252 3026.0011 3026.0504 3061.9755 3070.3933 3078.9090 3085.7574 3095.0041 3107.0031 3108.4198 3108.5455 3116.5655 3119.5314 3124.0855 3125.2591 3136.2109 3138.5909 3145.4252 3152.0103 3161.9560 3164.1044 3515.7396 3536.7231
redmass: 5.8511 5.5432 4.1606 6.7552 6.7256 5.7091 4.5716 4.9672 4.7114 4.8793 7.7299 7.4445 6.0157 7.1131 6.3067 2.8602 2.1213 3.4488 3.9156 4.3024 3.9756 3.1478 6.5475 4.0385 1.5093 2.3268 5.7030 5.5286 4.5472 3.2959 1.2166 4.1413 4.0204 7.1306 4.5681 4.4016 7.0088 2.8083 2.8603 5.4878 4.3855 4.0334 4.3647 5.3907 4.6929 3.9054 2.9738 6.4553 2.7189 4.3696 1.8590 5.1114 5.1804 2.5449 2.5391 4.9709 5.6738 3.5510 5.1225 1.9775 1.9061 4.0994 3.6965 2.1773 6.5698 4.0421 4.7310 7.5468 4.0553 4.6908 5.0953 1.2563 2.9729 1.4963 4.0051 4.7544 1.6000 1.4716 2.5237 1.5709 2.2602 2.8662 1.3924 1.3915 5.6195 4.1149 3.8315 1.4635 1.3254 1.4425 3.3157 2.1820 2.9181 3.0958 1.4887 2.7978 1.6489 3.2511 1.7048 1.7731 1.5651 1.9449 1.0926 1.0611 2.7972 2.4876 1.1262 1.1518 2.2369 2.6432 2.0355 1.7992 1.8228 2.0932 1.7444 1.5543 2.1930 1.6980 2.1197 1.6810 1.8018 1.3327 1.5464 8.4266 1.1972 4.9536 1.1942 1.2122 6.4153 3.4076 2.3556 2.0630 1.0499 1.1044 1.0488 1.0877 1.0490 1.7482 1.1626 2.2082 2.2386 6.4370 6.0930 5.9777 6.0155 6.0539 7.2252 9.1344 12.7204 1.0379 1.0406 1.0361 1.0840 1.0835 1.0839 1.0933 1.0968 1.0990 1.1008 1.0982 1.0997 1.0933 1.0863 1.0848 1.0875 1.0872 1.0920 1.0923 1.0962 1.0954 1.1015 1.1007 1.0643 1.0777
irintensity: 0.5154 0.1376 0.0073 0.0692 0.0799 0.8513 0.5397 0.8426 0.3434 0.3399 2.3329 2.8612 3.7569 2.9256 0.9901 4.8427 2.0913 5.1839 0.8995 7.4327 0.1675 1.4059 12.2514 1.1141 2.1803 3.3103 3.9021 0.4014 1.0955 1.3115 0.3853 0.6250 0.0665 6.4617 5.1824 18.2886 2.5662 0.1107 0.1008 5.5874 17.2703 1.7518 2.8072 10.0309 7.1598 31.2807 32.3974 19.5628 51.0375 13.3017 55.8471 1.5205 8.1852 63.0160 45.0235 10.8697 1.6937 42.2555 8.1146 59.1830 50.8189 23.2391 24.5093 52.2728 20.0261 18.0663 5.4164 7.9091 2.1174 5.9880 12.0252 0.1573 4.5816 0.3930 12.3806 37.9845 1.9904 3.6181 1.0996 5.0937 13.5706 13.0930 0.2719 0.0524 1.0214 1.7156 6.2627 0.2922 0.7192 7.3866 0.8510 12.5022 154.3528 17.5784 5.2293 216.1673 0.6241 67.2011 11.3243 61.2707 10.1495 15.4268 0.9898 0.1857 36.2547 5.1570 1.9827 5.6156 31.2487 0.0732 2.3706 7.4597 5.6075 40.5641 6.3068 18.4811 165.2409 40.3169 42.9903 16.6740 12.7758 2.3468 23.7675 2.5579 29.7845 0.7673 16.5533 10.3524 38.0258 37.1636 65.9732 3.0254 0.1648 47.4879 7.8376 39.9545 18.9866 344.1555 123.1486 88.7590 4.0990 45.4710 7.4092 1.7601 17.4111 21.8819 154.5361 199.9912 354.7265 18.2743 8.3642 17.7350 10.3085 1.6213 30.2950 6.0937 11.3544 16.9846 14.3280 11.6552 6.1507 9.3995 4.8789 2.7851 0.7454 0.8666 11.7507 27.0586 27.3382 35.9091 29.4806 21.6115 37.7971 27.7638
temp: 298.150 k
press: 1.00000 atm
elementType: 16 8 8 8 8 8 7 7 7 6 6 6 6 6 6 6 6 6 6 6 6 6 6 6 6 6 6 6 6 6 6 6 6 6 6 1 1 1 1 1 1 1 1 1 1 1 1 1 1 1 1 1 1 1 1 1 1 1 1 1
symmnumber: 1
zpe: 1208336.3 jmol-1
zpe.correction: 0.460231 hartree
zpe.thermalcorrener: 0.491315 hartree
zpe.thermalcorrenthalpy: 0.492260 hartree
zpe.thermalcorrgfe: 0.395173 hartree
zpe.sumelectzpe: -1941.661492 hartree
zpe.sumelectthermal: -1941.630407 hartree
zpe.sumelectthermalent: -1941.629463 hartree
zpe.sumelectthermalfe: -1941.726549 hartree
dipole: 6.3757 3.2520 2.3681
dipole: 7.5387
quadrupole: -183.6268 -211.7321 -212.4454
quadrupole: 7.8129 15.2037 -0.2372
quadrupole: 18.9746 -9.1306 -9.8440 7.8129 15.2037 -0.2372
hfenergy: -1942.1217227 hartree
pointgroup: C01 [X(C26H25N3O5S1)]
dipole: -2.1432042 -2.0489748 -0.0732922 debye
polarizability: 391.2828547|34.8823889|315.9238021|9.1418481|8.6205577|280.5267476 unknown
InChI: InChI=1S/C26H25N3O5S/c1-14-17(22(30)27-20-23(31)29-21(25(32)33)26(2,3)35-24(20)29)19(28-34-14)18(15-10-6-4-7-11-15)16-12-8-5-9-13-16/h4-13,18,20-21,24,27,32H,1-3H3
charge 0 multiplicity 1
60 atoms
S  -3.20785 -2.121659 -0.209724
O  -4.287867 1.788417 1.199263
O  -8.042866 -0.984259 -0.370609
O  -6.973595 -0.020283 -2.200543
O  0.110032 1.760968 -0.723236
O  1.799524 0.452699 3.391359
N  -4.565124 0.149707 -0.578992
N  -1.413646 0.45339 0.458865
N  2.893283 0.522409 2.395424
C  -3.304938 -0.442858 -1.10114
C  -5.156967 -2.246397 -0.302326
C  -5.666945 -0.733813 -0.200691
C  -2.512564 0.741983 -0.424703
C  -3.892898 1.086176 0.254263
C  -5.520372 -2.912389 -1.64732
C  -5.648922 -3.075282 0.896901
C  -6.914981 -0.51272 -1.060144
C  -0.156876 1.039765 0.289273
C  0.821618 0.768309 1.37044
C  2.265655 0.723682 1.217636
C  3.04226 0.824422 -0.086772
C  0.581184 0.605387 2.734326
C  3.286847 -0.563379 -0.706155
C  4.326873 1.663215 0.061564
C  -0.636239 0.614454 3.604845
C  3.250717 -0.69368 -2.117981
C  4.270588 3.047345 -0.239322
C  3.584192 -1.706548 0.077665
C  5.552502 1.106626 0.500337
C  3.511338 -1.936303 -2.735573
C  5.415449 3.863587 -0.100652
C  3.843433 -2.95185 -0.538912
C  6.698267 1.920695 0.639655
C  3.809329 -3.072139 -1.946782
C  6.63508 3.301557 0.340913
H  -3.229082 -0.56943 -2.188721
H  -5.94342 -0.519047 0.848628
H  -2.173444 1.497645 -1.153544
H  -5.181907 -2.315602 -2.511538
H  -5.047527 -3.906169 -1.709604
H  -6.615854 -3.049877 -1.728196
H  -5.280754 -4.114301 0.834846
H  -5.309926 -2.641808 1.853751
H  -6.754182 -3.102239 0.898251
H  -1.560527 -0.232216 1.202762
H  -8.856397 -0.848342 -0.92848
H  2.373943 1.376852 -0.772249
H  -1.040818 -0.405451 3.752404
H  -0.380835 1.011087 4.601404
H  -1.430667 1.242258 3.167411
H  3.019155 0.184382 -2.7331
H  3.324536 3.486116 -0.580607
H  3.608261 -1.623414 1.170306
H  5.614239 0.038177 0.73034
H  3.479488 -2.019412 -3.827917
H  5.356324 4.931894 -0.338158
H  4.071982 -3.826894 0.080373
H  7.640615 1.477623 0.981634
H  4.009417 -4.038171 -2.423922
H  7.525863 3.930902 0.448373
