program: Gaussian 09
title: 000173319
version: EM64L-G09RevD.01
frameworkgroup: C1[X(C16H12Br2O)]
method: RPBEPBE
basis: SDD
operation: Freq
keyword: #p
keyword: freq=noraman
keyword: PBEPBE/SDD
title: #p freq=noraman PBEPBE/SDD
converged: YES YES NO NO
title: Mulliken charges:
elementType: Br Br O C C C C C C C C C C C C C C C C H H H H H H H H H H H H
charge: 0.018335 0.003085 -0.446915 0.003269 0.377484 0.404069 -0.586515 -0.343106 -0.384286 -0.409316 -0.364455 -0.184964 -0.184064 -0.194735 -0.177253 0.266555 -0.227361 -0.224232 -0.520414 0.239695 0.239692 0.278233 0.250692 0.248312 0.288122 0.346993 0.253849 0.249594 0.252253 0.249663 0.277718
chargesum: 0.00000
title: Mulliken charges with hydrogens summed into heavy atoms:
elementType: Br Br O C C C C C C C C C C C C C C C C
charge: 0.018335 0.003085 -0.099921 0.003269 0.377484 0.404069 -0.107127 -0.064873 -0.133594 -0.161003 -0.076333 0.068885 0.065531 0.057518 0.072410 0.266555 -0.227361 -0.224232 -0.242695
polarizability: 2.87403236e+02 -1.80609460e+01 1.88708037e+02 -1.74126796e+01 4.16092079e+00 1.39204987e+02
1716.lowfreq: -7.3656 -3.0288 -0.0006 -0.0003 0.0002 2.9511 22.5675 26.0002 41.7111
frequency: 22.5568 25.9788 41.7072 44.6387 85.1948 89.4311 111.8677 144.3239 162.2775 196.7730 201.3716 237.4189 250.7533 287.8561 306.3406 326.9484 338.6580 350.2506 380.6937 392.2869 400.2951 405.1245 406.5171 464.0915 512.8340 543.0550 609.9166 623.0856 624.5350 638.3190 651.3032 673.6029 716.1606 723.1963 733.6091 820.4650 829.6276 836.3860 839.9833 850.2774 905.1075 951.4750 960.1122 969.5978 978.6989 982.0149 991.5184 996.9974 1008.4397 1039.0918 1061.1473 1063.7875 1113.0137 1121.5668 1150.5029 1187.3956 1188.7193 1193.8439 1200.9980 1291.2492 1295.5183 1301.5432 1331.2764 1361.9432 1369.4517 1385.8572 1387.8980 1449.8383 1470.1739 1471.9682 1575.3883 1580.3057 1592.6555 1596.2612 2150.5039 2966.1187 3025.1956 3132.0724 3147.1159 3152.5087 3161.2535 3169.0366 3170.0985 3174.4316 3187.8632 3427.1620 3556.7789
redmass: 17.9400 3.9770 4.0590 6.0447 5.3755 4.9576 8.4962 5.4900 9.5458 5.5857 7.7170 7.1895 5.2725 4.2601 1.5416 3.6731 3.7851 2.7031 4.9839 4.8241 7.2125 2.9529 3.0254 4.6914 3.3554 3.6352 3.8475 7.0944 6.6673 1.2382 1.2765 6.1061 5.5397 4.0456 3.5496 1.7845 1.4494 1.4509 1.3117 2.0160 4.5208 1.4670 1.3827 2.6075 1.3763 1.4041 4.3044 4.4328 2.9912 4.8070 2.5589 2.6281 1.3753 1.4331 2.0113 1.2046 1.1320 1.2549 2.2378 1.2857 1.3124 1.3755 1.8752 5.3536 5.3828 3.3270 3.5100 1.1154 2.3757 2.2090 7.4028 7.7805 6.1021 6.1473 6.0238 1.0595 1.0991 1.0893 1.0877 1.0886 1.0901 1.0953 1.0958 1.0972 1.0953 1.1598 1.0659
irintensity: 0.0592 0.2632 0.0268 0.0222 0.3000 0.1727 0.3082 0.2321 0.6432 2.6733 1.3494 0.6594 3.6328 11.5419 104.3221 48.3205 20.7806 11.0280 3.1297 18.5465 15.5223 4.6813 3.0610 20.8446 16.0134 23.4019 14.0970 0.6707 1.5912 65.1130 67.4026 15.0909 8.7096 3.3546 16.5053 95.6258 43.6668 9.1339 20.5976 12.3862 38.8803 7.6484 1.0144 25.2691 0.0507 2.0102 50.2331 77.4988 21.0631 19.9529 23.6167 36.5017 1.2299 3.7935 30.7628 9.9971 5.0753 6.3916 9.4435 0.5382 2.5774 11.2328 23.2797 2.6067 13.0368 16.2727 12.8078 7.3705 107.3240 51.6686 2.6655 3.6689 23.9038 12.9217 3.7010 31.3805 12.7005 7.5698 8.1560 0.9805 3.3185 3.8527 8.5057 0.1945 1.2210 69.6115 8.6386
temp: 298.150 k
press: 1.00000 atm
elementType: 35 35 8 6 6 6 6 6 6 6 6 6 6 6 6 6 6 6 6 1 1 1 1 1 1 1 1 1 1 1 1
symmnumber: 1
zpe: 591225.6 jmol-1
zpe.correction: 0.225186 hartree
zpe.thermalcorrener: 0.243517 hartree
zpe.thermalcorrenthalpy: 0.244462 hartree
zpe.thermalcorrgfe: 0.175294 hartree
zpe.sumelectzpe: -717.641371 hartree
zpe.sumelectthermal: -717.623040 hartree
zpe.sumelectthermalent: -717.622095 hartree
zpe.sumelectthermalfe: -717.691263 hartree
dipole: 1.7285 2.3969 -0.6572
dipole: 3.0273
quadrupole: -141.2330 -125.9330 -123.4990
quadrupole: -0.3190 -3.2746 -0.0064
quadrupole: -11.0113 4.2886 6.7227 -0.3190 -3.2746 -0.0064
hfenergy: -717.8665569 hartree
pointgroup: C01 [X(C16H12Br2O1)]
dipole: 0.582279 1.0338267 -0.1036471 debye
polarizability: 289.3633616|-4.9418917|184.1607604|-21.1097472|9.7815679|141.7921387 unknown
InChI: InChI=1S/C16H12Br2O/c1-2-11-16(19,12-3-7-14(17)8-4-12)13-5-9-15(18)10-6-13/h1,3-10,19H,11H2
charge 0 multiplicity 1
31 atoms
Br 5.727357 -1.573378 -0.437733
Br -4.612356 -3.163369 -0.608605
O  -0.084689 1.426164 1.810288
C  0.013176 1.031936 0.387305
C  1.41364 0.437197 0.132965
C  -1.092694 -0.015416 0.172527
C  -0.251916 2.289546 -0.517723
C  1.90342 -0.51421 1.066911
C  -1.035779 -0.897872 -0.933392
C  2.22992 0.776804 -0.973127
C  -2.205807 -0.074771 1.043534
C  3.170177 -1.111284 0.908581
C  -2.07198 -1.826376 -1.175422
C  3.505237 0.188819 -1.147896
C  -3.24664 -1.004196 0.820969
C  -1.515391 2.980704 -0.225196
C  3.960735 -0.750046 -0.20376
C  -3.167786 -1.867332 -0.28965
C  -2.563322 3.592844 -0.013727
H  -0.256947 1.971937 -1.578353
H  0.591627 2.999983 -0.395554
H  1.280025 -0.782504 1.925772
H  -0.172858 -0.88275 -1.609067
H  1.896325 1.502941 -1.721144
H  -2.247782 0.60317 1.899051
H  0.607718 2.110663 1.996899
H  3.533535 -1.843708 1.635068
H  -2.019473 -2.506787 -2.030006
H  4.126587 0.460731 -2.005924
H  -4.102948 -1.048169 1.500002
H  -3.484913 4.112628 0.174108
