program: Gaussian 09
title: 000173370
version: EM64L-G09RevD.01
frameworkgroup: C1[X(C12H13Cl2N2O7P)]
method: RPBEPBE
basis: SDD
operation: Freq
keyword: #p
keyword: freq=noraman
keyword: PBEPBE/SDD
title: #p freq=noraman PBEPBE/SDD
converged: YES YES NO NO
title: Mulliken charges:
elementType: Cl Cl P O O O O O O O N N C C C C C C C C C C C C H H H H H H H H H H H H H
charge: -0.018201 -0.014526 1.389790 -0.305116 -0.521501 -0.448820 -0.428779 -0.658431 -0.640170 -0.615711 -0.193916 -0.063353 -0.087725 -0.046537 -0.190881 -0.074003 -0.346255 0.359189 -0.215704 -0.017549 -0.313723 -0.288069 -0.067874 -0.081142 0.286788 0.258851 0.237677 0.287779 0.187086 0.228141 0.388990 0.274890 0.269456 0.358589 0.281802 0.415289 0.413666
chargesum: 0.00000
title: Mulliken charges with hydrogens summed into heavy atoms:
elementType: Cl Cl P O O O O O O O N N C C C C C C C C C C C C
charge: -0.018201 -0.014526 1.389790 -0.305116 -0.521501 -0.059829 -0.070190 -0.243142 -0.226505 -0.615711 -0.193916 -0.063353 0.199063 0.212314 0.046796 0.213777 0.068973 0.359189 0.059186 -0.017549 -0.044267 -0.006266 -0.067874 -0.081142
polarizability: 2.74631180e+02 -2.94074055e+01 1.96199405e+02 -1.50234032e+00 -3.09260471e+01 1.57826758e+02
1716.lowfreq: -5.5888 -4.7128 0.0019 0.0021 0.0028 1.1228 4.5805 11.4336 25.6941
frequency: 1.7998 10.9833 25.6670 33.9691 55.0575 68.8864 70.0076 91.2772 117.0248 124.9665 141.9442 146.4873 167.8908 181.0949 188.0536 191.2140 225.5852 241.1272 256.8230 270.9258 288.9095 316.7462 322.1831 329.9503 339.2508 350.4997 360.4041 372.9612 382.9999 415.3005 422.4315 428.4732 436.2042 502.4328 533.4543 556.9234 611.1602 621.2263 637.1056 638.4385 661.2287 667.6923 698.7401 728.6646 746.2898 755.0881 777.7760 795.3794 812.4206 832.4400 842.6761 847.2342 865.3070 883.1302 901.5639 968.1388 975.8347 988.8047 1008.8865 1012.4993 1018.4730 1032.3277 1036.6688 1042.4602 1065.2173 1074.7519 1087.7929 1113.1120 1158.8939 1182.5008 1201.3052 1218.4453 1225.6121 1238.0603 1256.6358 1264.3980 1271.3941 1289.9296 1306.7075 1323.1954 1337.9492 1348.3818 1372.7103 1383.6912 1387.5876 1407.4866 1417.4289 1445.0221 1450.8067 1458.7994 1573.2219 1622.3588 2940.7188 2984.1679 3002.3554 3037.5309 3054.1478 3077.7562 3175.0822 3184.6374 3246.4218 3329.1082 3550.7908 3594.9185 3604.1569
redmass: 9.8328 8.1506 9.3395 9.8008 6.9662 6.5982 8.9423 6.6505 3.9329 7.5361 3.0802 3.1727 4.0420 3.0607 14.5590 5.0699 2.2954 4.3557 4.5673 7.7562 4.7980 3.6812 7.8527 5.1950 3.9479 6.2135 13.0800 7.5211 6.7484 8.6132 2.8940 2.6334 1.6505 5.6260 3.5860 5.2374 5.2359 4.5923 7.6513 6.5560 6.7250 5.0784 1.3886 6.7020 3.8442 4.3010 6.4162 4.7796 4.0959 1.3856 2.0984 2.5393 3.4192 1.4899 7.2057 3.1176 6.7306 4.0428 1.4804 2.1717 2.8946 3.3358 4.0753 2.2874 4.0213 2.3184 2.4799 2.7409 4.0035 1.1947 1.8107 1.3220 1.4510 1.2176 1.8920 1.4080 1.4887 1.2981 1.2528 1.4022 1.2252 3.7494 4.2347 1.4932 1.5770 1.5365 2.8389 4.4401 5.9386 1.0896 10.0218 8.6303 1.0696 1.0855 1.0844 1.0866 1.0856 1.0942 1.0932 1.0936 1.0981 1.0675 1.0658 1.0666 1.0667
irintensity: 0.2924 0.2257 0.7794 0.3721 2.1801 0.9550 1.0791 3.3532 1.6158 0.5870 15.2135 34.8763 39.4269 42.9741 2.8741 6.8729 61.2049 27.4028 16.8119 0.2033 2.9565 60.1057 8.5209 31.4930 25.5950 27.9002 5.0835 24.1184 20.5313 14.1368 21.4778 58.7060 115.1206 9.0647 20.9790 21.9507 28.7590 10.7440 34.3116 1.0738 77.1323 4.7164 106.3092 33.2822 0.8776 233.7438 187.2394 73.7646 6.1663 25.8437 5.2480 2.8076 76.2498 33.7385 19.8578 73.0651 210.8106 44.2577 8.4973 94.5708 133.0323 4.9846 96.5720 160.2677 57.3020 18.0855 48.2071 5.6070 11.1966 20.4769 89.9911 18.5571 50.0123 13.8634 7.6286 13.2830 5.6471 14.2580 32.3706 20.1818 27.6485 17.0880 43.0452 21.6394 34.1054 23.8498 12.1663 233.4711 15.8446 7.4786 21.6209 9.9946 56.4060 36.0517 6.4577 14.7074 7.9875 28.2209 0.6899 0.3243 0.5934 206.6098 12.4536 101.6076 99.2703
temp: 298.150 k
press: 1.00000 atm
elementType: 17 17 15 8 8 8 8 8 8 8 7 7 6 6 6 6 6 6 6 6 6 6 6 6 1 1 1 1 1 1 1 1 1 1 1 1 1
symmnumber: 1
zpe: 661790.6 jmol-1
zpe.correction: 0.252063 hartree
zpe.thermalcorrener: 0.276330 hartree
zpe.thermalcorrenthalpy: 0.277275 hartree
zpe.thermalcorrgfe: 0.192515 hartree
zpe.sumelectzpe: -2360.658291 hartree
zpe.sumelectthermal: -2360.634024 hartree
zpe.sumelectthermalent: -2360.633080 hartree
zpe.sumelectthermalfe: -2360.717839 hartree
dipole: 4.4629 4.6024 1.6718
dipole: 6.6253
quadrupole: -180.3682 -160.1003 -162.1835
quadrupole: 11.4836 14.8594 2.8871
quadrupole: -12.8175 7.4504 5.3672 11.4836 14.8594 2.8871
hfenergy: -2360.9103542 hartree
pointgroup: C01 [X(C12H13Cl2N2O7P1)]
dipole: 1.8161891 -1.6800984 -0.8203498 debye
polarizability: 270.629459|31.9721172|201.6152233|-3.4970831|-32.0149062|156.4126608 unknown
InChI: InChI=1S/C12H13Cl2N2O7P/c13-5-1-7-8(2-6(5)14)16(4-15-7)12-11(23-24(19,20)21)10(18)9(3-17)22-12/h1-2,4,9-12,17-20H,3H2
charge 0 multiplicity 1
37 atoms
Cl -4.068105 -2.066562 2.090754
Cl -6.162071 -0.530348 0.110918
P  2.134611 -2.866543 -0.764843
O  1.618925 1.984521 0.640702
O  1.223448 -1.517668 -0.241138
O  3.391152 -0.720021 1.486729
O  3.674851 3.943033 0.485193
O  2.19592 -2.584466 -2.441323
O  1.006611 -4.135108 -0.665245
O  3.520696 -3.087211 -0.005796
N  -0.430497 1.120512 -0.163944
N  -1.899331 2.186603 -1.567809
C  1.763239 -0.148836 -0.347998
C  0.822368 0.764455 0.473358
C  3.164435 0.098278 0.309599
C  3.060961 1.571848 0.788157
C  3.88156 2.585369 -0.011774
C  -1.69144 0.555794 0.099391
C  -0.624666 2.08525 -1.172207
C  -2.594566 1.232788 -0.787178
C  -2.115886 -0.456738 0.979455
C  -3.966552 0.90189 -0.786783
C  -3.488536 -0.767132 0.966367
C  -4.400392 -0.099283 0.099358
H  1.766905 0.156194 -1.41067
H  0.609811 0.280024 1.446911
H  3.969026 -0.040887 -0.441435
H  3.318578 1.610546 1.860996
H  3.628001 2.509601 -1.092784
H  4.958244 2.383477 0.119691
H  3.651916 -1.643653 1.193089
H  0.195343 2.696537 -1.540177
H  -1.436916 -1.000953 1.640157
H  2.698136 4.11482 0.515803
H  -4.667231 1.408138 -1.454805
H  2.635296 -3.276578 -2.997057
H  0.952358 -4.599792 0.208736
