program: Gaussian 09
title: 000173434
version: EM64L-G09RevD.01
frameworkgroup: C1[X(C23H14N2O7S)]
method: RPBEPBE
basis: SDD
operation: Freq
keyword: #p
keyword: freq=noraman
keyword: PBEPBE/SDD
title: #p freq=noraman PBEPBE/SDD
converged: YES YES NO NO
title: Mulliken charges:
elementType: S O O O O O O O N N C C C C C C C C C C C C C C C C C C C C C C C H H H H H H H H H H H H H H
charge: 0.917876 -0.362403 -0.482064 -0.485910 -0.212606 -0.420522 -0.482996 -0.221089 -0.012417 0.034269 -0.240678 0.517407 0.234738 -0.259142 -0.337171 -0.374585 0.073495 -0.162782 -0.232278 0.241103 -0.419253 0.228765 0.112015 0.018057 -0.358128 0.182593 0.330491 -0.353801 -0.327771 -0.345546 -0.242334 -0.244676 -0.232430 0.299226 0.319951 0.294405 0.251830 0.255014 0.278065 0.235123 0.244250 0.271609 0.229355 0.230738 0.395084 0.230311 0.384814
chargesum: 0.00000
title: Mulliken charges with hydrogens summed into heavy atoms:
elementType: S O O O O O O O N N C C C C C C C C C C C C C C C C C C C C C C C
charge: 0.917876 -0.362403 -0.482064 -0.485910 -0.212606 -0.025438 -0.098182 -0.221089 -0.012417 0.034269 -0.240678 0.517407 0.234738 0.040084 -0.017220 -0.080180 0.073495 -0.162782 0.019552 0.241103 -0.164239 0.228765 0.112015 0.018057 -0.080064 0.182593 0.330491 -0.118677 -0.083521 -0.073937 -0.012978 -0.013938 -0.002120
polarizability: 4.69839162e+02 1.95395222e+01 4.18347960e+02 4.45877097e+01 -4.66318994e+01 2.18743000e+02
1716.lowfreq: -5.3070 -3.1506 0.0008 0.0008 0.0010 3.4584 12.0539 16.0201 22.4972
frequency: 12.0239 15.9513 22.3709 33.9373 37.8846 53.8570 60.0694 66.8150 71.8808 78.9136 94.9285 105.0848 124.5183 133.8755 139.7949 168.0694 177.1648 206.2177 210.6541 222.7486 232.7345 237.4469 254.9951 264.2260 281.7298 294.1382 306.0231 321.2851 330.3445 349.8853 371.1707 381.8655 397.4135 403.2349 413.3949 420.3537 438.3823 443.3646 485.5719 487.2005 487.7420 505.1064 507.1375 529.1206 536.0151 558.9458 569.5626 576.4363 600.7284 613.3601 628.6312 635.0864 670.7284 679.6255 687.1013 693.9497 705.7582 717.7428 745.5780 772.9711 778.9353 793.5692 803.5248 818.9902 822.9030 844.7931 851.4499 856.3276 856.6756 932.6479 934.0444 934.7858 938.4627 949.8898 961.3692 964.6733 985.1610 990.0557 1000.9944 1003.0696 1009.5540 1028.1939 1066.0358 1085.1558 1089.6668 1123.3962 1146.3150 1151.6518 1173.0534 1188.2846 1189.4359 1200.5399 1214.8725 1233.7033 1248.6571 1259.0049 1267.2784 1272.5570 1291.8747 1300.5618 1319.8755 1377.5215 1379.3137 1386.4563 1399.7494 1431.4853 1433.1843 1441.0891 1468.2560 1471.2989 1479.3999 1525.1229 1531.9281 1541.5960 1567.8366 1587.0544 1597.5629 1602.7479 1605.7478 1608.3325 2037.0499 3126.4449 3134.5691 3138.3622 3150.4445 3150.6205 3158.0736 3159.8410 3161.9224 3170.2493 3170.6525 3175.9237 3183.4389 3494.5554 3625.3522
redmass: 8.2188 6.3683 7.8692 6.9349 6.8222 7.0843 7.6694 5.3998 7.6439 8.8346 10.1994 8.4657 9.4105 11.6989 9.6478 5.6048 6.4763 5.4688 6.5739 9.7435 8.2562 6.8620 5.9612 5.4737 1.2439 4.2516 6.9257 7.2489 8.5098 9.7930 9.5998 9.0464 9.2799 2.9095 7.4868 5.7110 11.9012 4.5746 6.8440 7.3890 6.3614 6.2633 1.1418 5.3799 5.4246 6.7847 5.4342 3.8639 6.1882 6.4320 6.9202 5.3254 6.1739 7.6320 3.5457 2.6626 2.5200 4.6419 7.1968 3.9139 1.7764 1.7815 1.5779 2.7041 7.2823 3.1017 5.0334 3.1107 1.6281 11.0411 2.3842 2.8464 1.6622 2.8726 1.3740 1.3663 1.3955 6.0758 1.6788 2.4217 1.3743 2.0987 2.0674 1.5817 3.4530 1.3441 1.9524 1.5617 1.0573 1.1706 1.3042 2.1214 3.4545 2.5531 2.2160 2.2241 2.1882 3.1913 2.4284 3.8743 1.3884 7.0725 6.2741 9.1088 2.1042 2.4944 2.3014 3.0271 3.2746 3.1571 2.3937 6.9463 10.0606 8.9932 7.2964 6.1847 6.7147 6.5995 7.5777 6.0677 13.8645 1.0851 1.0901 1.0885 1.0875 1.0931 1.0894 1.0920 1.0960 1.0997 1.0952 1.0995 1.0978 1.0645 1.0668
irintensity: 0.0360 0.0144 0.1922 1.2230 0.8559 3.6057 7.2393 0.2484 1.1934 5.6581 1.0277 2.1880 5.5060 1.1349 2.1653 1.4886 4.3650 2.3767 1.0591 14.0996 0.6617 6.6793 4.2149 3.5952 136.4558 25.4607 17.5987 11.5957 5.1772 7.7908 7.2627 19.7373 9.2178 0.5233 76.5489 37.4194 9.6010 0.6640 3.6721 4.8227 21.2732 9.5785 93.6958 1.9803 20.1552 7.4477 17.2743 1.2562 19.5865 0.3493 17.5714 13.3003 22.9079 0.8412 2.2940 29.2826 87.5451 18.9095 6.6829 17.7131 12.4414 22.7326 52.2363 74.6583 55.2274 1.9132 5.7775 21.7796 10.4894 32.0471 4.9199 63.9120 3.3274 4.4270 1.6281 0.5361 0.7420 0.1248 57.6850 137.2151 1.5477 5.3380 4.6423 8.6222 1.8788 122.4986 15.1695 13.2347 0.5305 10.7975 31.2188 32.5365 46.9197 11.3213 155.5616 33.0860 32.5368 140.5119 5.2448 286.0693 30.2601 43.4409 7.7941 3.5778 56.0320 24.4818 21.6853 1.2183 10.0627 38.8498 3.3040 60.5199 166.3980 132.3826 15.5675 20.7083 52.7944 199.5654 35.4831 7.7934 760.7753 0.4015 12.5618 8.0329 2.3091 23.1661 6.7234 10.1836 13.5484 16.0822 1.9994 9.3064 15.1862 124.8557 109.5502
temp: 298.150 k
press: 1.00000 atm
elementType: 16 8 8 8 8 8 8 8 7 7 6 6 6 6 6 6 6 6 6 6 6 6 6 6 6 6 6 6 6 6 6 6 6 1 1 1 1 1 1 1 1 1 1 1 1 1 1
symmnumber: 1
zpe: 836955.4 jmol-1
zpe.correction: 0.318779 hartree
zpe.thermalcorrener: 0.348358 hartree
zpe.thermalcorrenthalpy: 0.349303 hartree
zpe.thermalcorrgfe: 0.255236 hartree
zpe.sumelectzpe: -1916.485317 hartree
zpe.sumelectthermal: -1916.455738 hartree
zpe.sumelectthermalent: -1916.454794 hartree
zpe.sumelectthermalfe: -1916.548861 hartree
dipole: 0.7158 4.5047 -3.6134
dipole: 5.8190
quadrupole: -213.7585 -147.0293 -205.4995
quadrupole: 23.8342 -12.9004 -7.5362
quadrupole: -24.9961 41.7331 -16.7370 23.8342 -12.9004 -7.5362
hfenergy: -1916.804097 hartree
pointgroup: C01 [X(C23H14N2O7S1)]
dipole: -0.1990861 -1.7169773 -1.5012 debye
polarizability: 449.5042598|34.00483|420.0179017|-74.6116714|47.0266874|237.407961 unknown
InChI: InChI=1S/C13H9O4.C10H5N2O3S/c14-10-7-6-9(12(16)13(10)17)11(15)8-4-2-1-3-5-8;11-12-8-5-4-6-7(10(8)13)2-1-3-9(6)16(14)15/h1-7,14,17H;1-5H
charge 0 multiplicity 1
47 atoms
S  -0.199343 -0.096056 1.865576
O  -0.988155 -0.508056 0.001298
O  0.310156 -1.481005 2.548913
O  -1.203667 0.865181 2.708965
O  5.428168 1.597004 -1.132379
O  -0.333926 -3.198322 -0.317206
O  -2.198182 -5.100425 -0.437748
O  -4.885878 0.520284 1.067188
N  5.462494 -1.070308 -1.852685
N  6.43314 -1.287921 -2.479075
C  1.224442 0.960487 1.20704
C  2.264617 0.380618 0.427025
C  3.314918 1.288098 0.034516
C  1.150797 2.311356 1.562094
C  2.296855 -1.011565 0.014028
C  3.268866 2.658669 0.40128
C  -1.998386 -1.430492 -0.038248
C  4.477515 0.829081 -0.773538
C  2.198852 3.173335 1.151587
C  -3.385515 -1.057106 0.080306
C  3.344605 -1.491893 -0.739097
C  4.429522 -0.620244 -1.12836
C  -1.663143 -2.810596 -0.207627
C  -3.86827 0.354381 0.323164
C  -4.373516 -2.066137 0.042134
C  -2.68811 -3.790069 -0.263972
C  -3.223671 1.533401 -0.338735
C  -4.040174 -3.42789 -0.136129
C  -2.534324 1.431292 -1.57533
C  -3.38827 2.808559 0.265215
C  -2.019121 2.587607 -2.198039
C  -2.856665 3.960275 -0.347818
C  -2.1726 3.852871 -1.583622
H  0.301463 2.677794 2.14787
H  1.472993 -1.680547 0.272686
H  4.094802 3.298045 0.074093
H  2.168106 4.232018 1.424994
H  3.366746 -2.53785 -1.05949
H  -5.417514 -1.765443 0.167914
H  -4.828174 -4.189436 -0.169211
H  -2.408185 0.454411 -2.05268
H  -3.932495 2.868223 1.213103
H  -1.496143 2.503631 -3.156899
H  -2.976288 4.939194 0.129465
H  -0.298793 -4.192332 -0.363555
H  -1.764789 4.748983 -2.065322
H  -2.911459 -5.781004 -0.39729
