program: Gaussian 09
title: 000012607
version: EM64L-G09RevD.01
frameworkgroup: C1[X(C8H4ClF3N2)]
method: RPBEPBE
basis: SDD
operation: Freq
keyword: #p
keyword: freq=noraman
keyword: PBEPBE/SDD
title: #p freq=noraman PBEPBE/SDD
converged: NO NO NO NO
title: Mulliken charges:
elementType: Cl F F F N N C C C C C C C C H H H H
charge: -0.044165 -0.116494 -0.159687 -0.159764 -0.436192 -0.013566 0.340628 0.012296 0.114316 -0.342892 -0.310397 0.261750 -0.076521 -0.205791 0.340205 0.270068 0.264427 0.261778
chargesum: 0.00000
title: Mulliken charges with hydrogens summed into heavy atoms:
elementType: Cl F F F N N C C C C C C C C
charge: -0.044165 -0.116494 -0.159687 -0.159764 -0.095987 -0.013566 0.340628 0.012296 0.114316 -0.072825 -0.045970 0.261750 -0.076521 0.055988
polarizability: 1.81655423e+02 -5.16637820e-02 1.05087940e+02 5.55936052e-03 -2.62181606e-03 4.90004158e+01
1716.lowfreq: -22.2128 0.0022 0.0024 0.0027 3.3653 8.4002 14.8066 61.1161 112.7263
frequency: -22.1496 61.0721 112.7244 137.8844 225.1912 235.1528 263.5403 289.7549 334.3826 377.7540 394.2760 427.9016 442.2302 498.3974 547.8652 587.3589 592.6991 621.1428 654.6505 681.1568 701.0828 759.3479 803.9927 826.0260 856.2494 898.3453 918.1960 960.6290 963.8409 1034.0122 1049.5030 1094.8870 1124.2545 1214.9234 1225.8000 1258.9719 1291.2296 1368.4997 1387.4579 1432.5772 1468.8661 1522.0705 1583.4318 1631.7958 3166.0933 3172.9478 3184.9829 3588.1188
redmass: 9.1870 11.2416 14.5170 11.2053 11.9092 5.9470 15.1213 6.4933 9.3783 9.3133 13.7042 3.2496 7.7485 10.0606 8.2521 8.0078 2.7016 1.4021 13.0658 8.0953 9.9986 3.4569 5.4486 1.5329 1.5173 6.2538 9.3202 1.7012 4.1337 7.7859 2.2235 5.5693 1.5183 2.5715 2.0465 2.2269 2.4017 4.5774 4.1039 3.9373 3.9592 5.7742 8.2281 7.7330 1.0888 1.0940 1.0981 1.0820
irintensity: 1.0870 1.5986 1.4526 0.6741 1.6644 8.9716 2.9722 2.3843 1.3344 0.4838 20.1520 16.1247 11.5131 0.5309 3.2168 0.8334 1.7217 82.6371 4.3250 12.4674 0.1506 1.4829 1.8407 49.5598 28.9814 28.0077 70.3504 57.2783 226.8890 215.2383 42.2756 173.3303 1.5755 7.6321 182.3495 0.9265 198.3531 47.3049 8.3683 8.0419 6.6331 103.6167 48.2163 33.6199 0.1306 0.1291 2.1439 85.7597
temp: 298.150 k
press: 1.00000 atm
elementType: 17 9 9 9 7 7 6 6 6 6 6 6 6 6 1 1 1 1
symmnumber: 1
zpe: 286943.9 jmol-1
zpe.correction: 0.109291 hartree
zpe.thermalcorrener: 0.119781 hartree
zpe.thermalcorrenthalpy: 0.120725 hartree
zpe.thermalcorrgfe: 0.072233 hartree
zpe.sumelectzpe: -1175.358233 hartree
zpe.sumelectthermal: -1175.347743 hartree
zpe.sumelectthermalent: -1175.346799 hartree
zpe.sumelectthermalfe: -1175.395291 hartree
dipole: -2.1955 -2.0114 0.0010
dipole: 2.9776
quadrupole: -100.8202 -77.7190 -88.8787
quadrupole: -6.7386 0.0022 -0.0021
quadrupole: -11.6809 11.4203 0.2606 -6.7386 0.0022 -0.0021
hfenergy: -1175.4675239 hartree
pointgroup: C01 [X(C8H4Cl1F3N2)]
dipole: -0.8264347 0.8302726 -0.0006107 debye
dipolederiv: -0.7856325 0.2060166 -0.0001849 0.313224 -0.2160814 0.000071 -0.0001515 0.0000366 -0.0600935 -0.6280659 0.2466262 -0.0003148 0.2520465 -0.6046786 0.0002583 -0.0003502 0.0003388 -0.2592587 -0.7207424 -0.1166598 0.1477819 -0.2946245 -0.4364742 0.2393058 0.2397666 0.2070375 -0.6363448 -0.720034 -0.1164805 -0.147859 -0.2941777 -0.4366671 -0.2395629 -0.2397515 -0.2071941 -0.6364121 -0.4275607 0.0705955 -0.0000601 -0.2322553 -0.5346516 -0.0000306 0.0000634 0.0002597 -0.2393385 -0.0647209 -0.1574171 0.0000274 0.1351121 -0.3850269 0.0000616 -0.0002429 -0.0001769 -0.2180099 0.3646718 0.1500505 -0.000007 0.1737949 0.0214373 0.0000084 0.0000428 -0.0000296 0.0916521 0.0203893 0.0692311 -0.0000471 -0.0647539 -0.0724835 -0.0000177 0.0000308 0.0000583 0.0093806 -0.6827271 -0.1853589 -0.0000899 -0.1850122 0.620178 -0.0000916 -0.0005222 -0.0001511 -0.067491 -0.2911463 -0.0403524 0.0000016 0.0264627 -0.0604412 0.0000104 -0.0000148 -0.0000246 -0.1424658 0.2839374 -0.055755 0.0001601 0.1043292 0.1315125 0.0000948 0.000211 0.00005 -0.1128758 2.5682381 0.0528942 0.0005995 0.2778465 1.4372059 -0.0000036 0.0009794 -0.000067 1.5768071 1.0663886 -0.3084971 0.0002352 -0.5915736 0.4172562 -0.0001416 0.0001813 0.0000029 -0.0614622 -0.3605898 0.1815418 -0.0000478 0.3550703 -0.1513724 0.0001309 0.0000294 0.00003 -0.129997 0.2157415 0.0360757 -0.0000609 0.0529429 0.2366565 -0.0000176 -0.0001048 -0.0000654 0.3556899 0.079463 0.0033125 -0.0000346 0.0197259 -0.0099419 -0.0000071 -0.0000444 -0.0000257 0.1914164 0.085413 0.030518 -0.0000255 -0.0002141 -0.0213989 -0.0000374 -0.0000503 -0.0000401 0.1678938 -0.003023 -0.0663414 -0.000074 -0.0479435 0.0649715 -0.000031 -0.0000721 -0.0000394 0.1709094 unknown
polarizability: 181.4979016|-3.4694818|105.2454395|0.052767|0.0052785|49.0004373 unknown
InChI: InChI=1S/C8H4ClF3N2/c9-4-1-2-5-6(3-4)14-7(13-5)8(10,11)12/h1-3,14H
charge 0 multiplicity 1
18 atoms
Cl -4.769624 1.046143 -0.001415
F  3.61349 -1.075683 0.002662
F  3.336999 0.882196 -1.130496
F  3.336198 0.882765 1.133916
N  0.570128 1.050939 0.000018
N  0.782039 -1.234257 -0.000048
C  -0.735971 0.550787 -0.000354
C  -0.58437 -0.882521 -0.000416
C  1.425856 -0.060298 0.000527
C  -1.995823 1.184698 -0.000722
C  -1.728701 -1.714242 -0.000899
C  2.907505 0.125484 0.001638
C  -3.101373 0.318239 -0.001101
C  -2.994239 -1.101605 -0.001281
H  0.855209 2.030003 0.000359
H  -2.122954 2.270358 -0.00069
H  -1.625254 -2.802679 -0.001082
H  -3.905714 -1.705628 -0.001715
