program: Gaussian 09
title: 000173173
version: EM64L-G09RevD.01
frameworkgroup: C1[X(C4H6O)]
method: RPBEPBE
basis: SDD
operation: Freq
keyword: #p
keyword: freq=noraman
keyword: PBEPBE/SDD
title: #p freq=noraman PBEPBE/SDD
converged: NO YES NO NO
title: Mulliken charges:
elementType: O C C C C H H H H H H
charge: -0.413168 -0.250044 -0.060101 -0.132087 -0.589620 0.214455 0.209906 0.243971 0.213517 0.210653 0.352517
chargesum: 0.00000
title: Mulliken charges with hydrogens summed into heavy atoms:
elementType: O C C C C
charge: -0.060651 -0.035588 0.149805 0.111884 -0.165450
polarizability: 9.41639164e+01 -7.16238877e+00 4.28717285e+01 -2.13861651e-04 1.86436976e-03 2.02329509e+01
1716.lowfreq: -9.3187 0.0007 0.0009 0.0011 2.3498 32.6657 162.1624 196.0465 265.9865
frequency: 162.1585 196.0462 265.9458 458.6063 472.1597 488.7684 652.0923 831.4587 905.8345 925.6535 943.1219 1003.1948 1061.4345 1167.6193 1219.8717 1282.3832 1296.0189 1344.6437 1432.8683 1604.7574 1656.8974 3076.4899 3090.1226 3100.1763 3178.1846 3206.9368 3566.7820
redmass: 3.5262 3.2128 1.7667 3.0169 1.3319 3.5348 1.4284 1.8385 1.1891 1.2825 1.4736 1.1169 2.3728 2.1825 1.4927 1.3502 1.3398 1.2739 1.2566 4.1993 5.3653 1.0895 1.0755 1.0777 1.0935 1.1143 1.0655
irintensity: 0.1929 8.0571 16.5847 2.6220 111.3000 4.8285 14.6227 3.2872 4.6003 158.4065 6.6930 62.7500 298.1437 1.0567 10.9109 13.2057 9.5443 5.8828 16.4974 17.3713 176.1693 7.3224 34.5199 4.1531 11.1660 26.7533 39.1133
temp: 298.150 k
press: 1.00000 atm
elementType: 8 6 6 6 6 1 1 1 1 1 1
symmnumber: 1
zpe: 230820.8 jmol-1
zpe.correction: 0.087915 hartree
zpe.thermalcorrener: 0.093632 hartree
zpe.thermalcorrenthalpy: 0.094576 hartree
zpe.thermalcorrgfe: 0.059555 hartree
zpe.sumelectzpe: -230.809631 hartree
zpe.sumelectthermal: -230.803914 hartree
zpe.sumelectthermalent: -230.802970 hartree
zpe.sumelectthermalfe: -230.837990 hartree
dipole: 0.1330 -1.0730 0.0000
dipole: 1.0812
quadrupole: -33.3819 -24.0863 -34.5173
quadrupole: 3.7112 0.0002 0.0008
quadrupole: -2.7201 6.5755 -3.8555 3.7112 0.0002 0.0008
hfenergy: -230.8975458 hartree
pointgroup: C01 [X(C4H6O1)]
dipole: 0.0569362 0.4215551 0.0000171 debye
dipolederiv: -1.5343189 0.1408684 0.0000134 0.7223842 -0.2029354 0.0000134 0.0000326 0.0000132 -0.4267128 -0.5870021 0.0428134 -0.0000021 -0.1902685 0.027084 0.0000099 -0.0000055 0.000013 -0.2342895 0.5824173 -0.0051822 0. -0.1599025 0.1372498 0.0000345 -0.000028 0.0000258 -0.1207682 1.4609199 -0.0769211 -0.0000075 -0.32203 0.3450851 0.0000267 0.0000035 0.0000301 -0.1062988 -0.3962557 -0.0677541 -0.0000066 -0.113281 0.0885017 0.0000633 -0.0000076 0.0000646 -0.4839889 0.0260087 0.0198117 0.000003 0.0733218 -0.133158 -0.0000184 0.0000035 -0.0000188 0.1939513 0.047857 -0.0410912 -0.0000035 0.0435589 -0.1393528 -0.0000335 0.0000004 -0.0000306 0.1621847 0.0747105 0.013827 0.000002 0.0315967 -0.0620313 -0.0000167 -0.0000008 -0.0000197 0.2075263 -0.0728137 0.0796084 0.0000085 0.0852955 0.0240203 -0.0000206 0.0000135 -0.0000195 0.2042304 0.0727961 0.022163 0.0000015 -0.0091738 -0.1339719 -0.0000378 -0.0000028 -0.0000372 0.206151 0.3256808 -0.1281433 -0.0000089 -0.1615013 0.0495086 -0.0000208 -0.0000088 -0.0000209 0.3980146 unknown
polarizability: 94.3146764|6.5988086|42.7209685|0.0002343|0.0018619|20.2329509 unknown
InChI: InChI=1S/C4H6O/c1-2-3-4-5/h2-5H,1H2
charge 0 multiplicity 1
11 atoms
O  -2.493701 0.211675 -0.000004
C  -0.027878 0.296783 -0.000008
C  1.264278 -0.383089 -0.000083
C  -1.223195 -0.368377 -0.000035
C  2.477668 0.246002 -0.000011
H  -0.017561 1.398461 0.000053
H  1.239094 -1.483491 -0.000202
H  -1.309812 -1.458388 -0.000104
H  3.413936 -0.321021 -0.000074
H  2.560842 1.339774 0.000111
H  -2.436272 1.20047 0.000057
