program: Gaussian 09
title: 000173250
version: EM64L-G09RevD.01
frameworkgroup: C1[X(C15H16N2O4)]
method: RPBEPBE
basis: SDD
operation: Freq
keyword: #p
keyword: freq=noraman
keyword: PBEPBE/SDD
title: #p freq=noraman PBEPBE/SDD
converged: YES YES NO NO
title: Mulliken charges:
elementType: O O O O N N C C C C C C C C C C C C C C C H H H H H H H H H H H H H H H H
charge: -0.388144 -0.219098 -0.241133 -0.242794 -0.139391 -0.194317 -0.278937 -0.179751 -0.010500 -0.414368 0.552059 0.158948 -0.629242 0.056739 -0.109274 -0.740892 -0.104016 0.307023 0.089419 -0.797850 -0.492063 0.284312 0.260275 0.224842 0.278440 0.242023 0.248038 0.189339 0.343418 0.226910 0.267756 0.262267 0.234934 0.234200 0.245541 0.251816 0.223472
chargesum: 0.00000
title: Mulliken charges with hydrogens summed into heavy atoms:
elementType: O O O O N N C C C C C C C C C C C C C C C
charge: -0.044726 -0.219098 -0.241133 -0.242794 -0.139391 -0.194317 0.005375 0.080524 -0.010500 0.088914 0.552059 0.158948 0.050159 0.056739 -0.109274 -0.246226 -0.104016 0.307023 0.089419 -0.066449 0.228766
polarizability: 2.54669663e+02 -1.96189849e+01 2.32554102e+02 1.75786946e+01 -9.14649340e+00 1.24946329e+02
1716.lowfreq: -7.4870 -5.6941 -0.0008 -0.0004 0.0002 5.7669 30.9841 49.4850 64.4981
frequency: 30.9020 49.4746 64.4945 74.9975 98.7269 105.6907 131.6353 155.0844 162.0081 182.1477 208.5094 216.0269 218.0996 236.3168 253.9399 267.2311 274.2483 292.0596 299.2259 321.6055 336.1865 356.0585 378.5508 398.3665 416.0760 424.3583 437.1702 484.7293 487.1397 518.1703 555.2749 599.5322 634.4803 670.8268 698.6007 707.4497 724.7771 743.8967 746.4967 792.0440 812.3082 820.8855 855.6572 873.2122 919.3345 945.0368 953.9907 966.0427 976.8391 982.4177 1005.2030 1024.2544 1040.8764 1055.9286 1066.3148 1081.2796 1102.1638 1108.6760 1114.8718 1125.0356 1134.7441 1145.4565 1183.1942 1184.7319 1193.2280 1248.0112 1280.4219 1298.8205 1321.9883 1325.0559 1346.3217 1392.0707 1397.4598 1423.8268 1429.2590 1436.5206 1444.7352 1449.3374 1452.9294 1466.3682 1467.6167 1468.8543 1468.9762 1478.2021 1502.3045 1536.8904 1545.0783 1584.0790 1660.9006 2907.5382 2986.2683 3002.5545 3010.3312 3045.6313 3060.9973 3096.0325 3101.1717 3109.1421 3110.3715 3119.1596 3126.7743 3133.8178 3134.5593 3226.0974 3508.3766
redmass: 4.2506 3.5102 5.4492 2.4922 2.5310 1.7677 3.2559 5.1517 4.0628 1.5090 2.4026 2.8854 1.2603 2.8133 3.3380 2.8587 3.5158 3.9635 3.3074 1.9178 1.9523 4.3115 7.4483 5.6949 5.0939 5.2970 6.1622 5.7244 8.9179 6.4840 5.5396 3.6425 4.3085 5.1885 4.2306 1.8259 4.7511 4.7496 4.3915 3.6717 6.7955 3.7551 3.5564 2.0816 4.4316 2.3241 1.6626 3.3767 1.8550 2.1358 2.5672 2.7629 1.4778 1.7515 2.6093 1.7726 1.2397 2.8786 2.3121 1.6282 1.8091 2.3200 2.0910 1.6360 1.4413 4.6275 1.4909 1.7766 2.6939 3.8729 2.6499 1.2617 2.8058 1.1785 1.6209 1.3333 1.6535 1.0732 1.4880 1.2358 1.0475 1.0494 1.0474 1.1883 8.6304 9.0247 9.0500 8.9788 6.8557 1.0502 1.0370 1.0670 1.0276 1.0800 1.0968 1.1019 1.0970 1.0992 1.0613 1.0877 1.1052 1.1064 1.0962 1.1154 1.0653
irintensity: 4.0567 3.4861 1.6978 0.4804 1.0378 0.0529 3.2611 5.3680 2.9379 1.1677 1.4433 4.2606 0.6512 4.6601 3.4736 2.7726 4.4747 0.8875 12.9972 48.5502 55.0504 6.9380 18.8699 9.3224 21.6620 4.3398 8.2727 2.1803 1.3108 3.8693 4.4123 14.2079 22.2577 10.3119 10.9931 1.4505 0.8496 0.6704 4.9362 36.4779 0.3026 12.5662 6.6733 8.4325 8.5871 49.2186 50.9433 65.5310 45.1788 9.5473 83.5270 38.4841 1.3825 4.5937 17.7623 4.1919 0.0240 26.2884 36.9578 6.0728 69.5220 31.7479 119.1862 15.8830 14.5450 178.6990 7.4396 11.9297 71.9940 65.3960 58.8236 23.8423 99.3594 5.7347 0.9205 47.2447 153.2266 13.7167 16.1402 4.7915 8.4725 9.0789 20.4440 9.1567 208.4559 12.0106 498.9242 12.7967 28.5118 115.1223 24.1391 41.9334 47.4851 27.9789 16.6339 14.4798 2.4107 3.0324 2.5912 9.7385 26.2686 40.2801 19.1289 2.7522 5.7131
temp: 298.150 k
press: 1.00000 atm
elementType: 8 8 8 8 7 7 6 6 6 6 6 6 6 6 6 6 6 6 6 6 6 1 1 1 1 1 1 1 1 1 1 1 1 1 1 1 1
symmnumber: 1
zpe: 744849.7 jmol-1
zpe.correction: 0.283698 hartree
zpe.thermalcorrener: 0.303775 hartree
zpe.thermalcorrenthalpy: 0.304719 hartree
zpe.thermalcorrgfe: 0.235873 hartree
zpe.sumelectzpe: -989.956467 hartree
zpe.sumelectthermal: -989.936391 hartree
zpe.sumelectthermalent: -989.935446 hartree
zpe.sumelectthermalfe: -990.004293 hartree
dipole: -4.0903 0.0900 1.3717
dipole: 4.3151
quadrupole: -86.2073 -132.2712 -122.6757
quadrupole: -6.6148 -0.7961 -2.0404
quadrupole: 27.5108 -18.5531 -8.9576 -6.6148 -0.7961 -2.0404
hfenergy: -990.2401657 hartree
pointgroup: C01 [X(C15H16N2O4)]
dipole: -1.639468 0.0920319 0.4311095 debye
polarizability: 250.6682563|-19.0207128|233.2279791|25.9793868|-13.1776254|128.2738585 unknown
InChI: InChI=1S/C15H16N2O4/c1-6-11(18)10-9(12(19)13(6)21-4)7(2)15(20)14-8(16(14)3)5-17(10)15/h8,14,20H,2,5H2,1,3-4H3
charge 0 multiplicity 1
37 atoms
O  -2.366892 -0.966157 -2.126591
O  0.644987 2.970626 -0.352391
O  1.976339 -2.312928 0.615348
O  3.975014 -0.204805 0.856433
N  -2.940785 0.400092 1.374812
N  -1.274732 0.794847 -0.760385
C  -3.209891 -0.289944 0.063755
C  -3.386325 1.225465 0.190885
C  -1.95964 -0.551203 -0.781678
C  -2.206651 1.921548 -0.496966
C  -0.864057 -1.519927 -0.313692
C  0.023739 0.638712 -0.333637
C  -3.945496 0.170007 2.443973
C  0.335955 -0.70395 -0.093365
C  0.99686 1.755661 -0.14155
C  -1.030673 -2.864661 -0.204043
C  1.65495 -1.101881 0.336863
C  2.350266 1.375046 0.282858
C  2.667795 0.032518 0.48277
C  3.379882 2.463001 0.47554
C  4.560537 -1.552577 1.058897
H  -4.056402 -0.979924 -0.028994
H  -4.378664 1.690529 0.193474
H  -2.522954 2.407163 -1.439716
H  -1.709075 2.67653 0.1300
H  -3.892635 1.010025 3.157697
H  -3.678815 -0.758958 2.976302
H  -4.995216 0.08035 2.079587
H  -3.0908 -0.362677 -2.444184
H  -1.994737 -3.333347 -0.426516
H  -0.191174 -3.503281 0.083612
H  2.928206 3.443924 0.259582
H  4.249565 2.30883 -0.189092
H  3.770994 2.462894 1.509514
H  4.445567 -2.172485 0.156019
H  4.081132 -2.064527 1.90669
H  5.620826 -1.337434 1.263988
