program: Gaussian 09
title: 000173301
version: EM64L-G09RevD.01
frameworkgroup: C1[X(C18H17ClF3NO4)]
method: RPBEPBE
basis: SDD
operation: Freq
keyword: #p
keyword: freq=noraman
keyword: PBEPBE/SDD
title: #p freq=noraman PBEPBE/SDD
converged: YES YES NO NO
title: Mulliken charges:
elementType: Cl F F F O O O O N C C C C C C C C C C C C C C C C C C H H H H H H H H H H H H H H H H H
charge: -0.061964 -0.153039 -0.164925 -0.167038 -0.307364 -0.277309 -0.243908 -0.281217 -0.428064 -0.384522 0.105897 0.144076 0.666863 0.232697 0.183300 0.142333 -0.756041 -0.813775 0.110102 -0.366507 -0.371965 -0.231270 -0.244432 -0.240800 -0.350377 -0.497744 0.422357 0.304727 0.303685 0.193728 0.276243 0.266817 0.217483 0.243671 0.323782 0.233261 0.253987 0.226460 0.232561 0.283754 0.259119 0.239287 0.239596 0.236476
chargesum: 0.00000
title: Mulliken charges with hydrogens summed into heavy atoms:
elementType: Cl F F F O O O O N C C C C C C C C C C C C C C C C C C
charge: -0.061964 -0.153039 -0.164925 -0.167038 -0.307364 -0.277309 -0.243908 -0.281217 -0.124378 -0.079795 0.105897 0.144076 0.666863 0.232697 0.183300 0.142333 -0.019254 -0.028839 0.110102 -0.366507 -0.138704 0.022717 -0.017972 -0.008239 0.192496 0.217614 0.422357
polarizability: 2.49183474e+02 -4.88734178e+00 2.54879471e+02 -1.28122541e+00 2.08926155e+01 1.98487848e+02
1716.lowfreq: -44.1457 -4.5426 -2.1975 -0.0009 0.0007 0.0024 5.2238 13.9958 21.1932
frequency: -44.0904 13.9434 21.1323 35.8323 41.0167 43.5481 46.3194 56.0764 62.0169 74.6835 94.9702 105.9754 111.2829 131.1373 149.2139 155.2138 166.0752 185.5726 198.7594 208.8413 222.0069 253.3548 271.2743 303.0906 315.8179 325.2870 334.8991 340.5346 353.7698 367.2394 385.2743 400.4793 406.3572 444.1420 451.7290 463.5813 493.7452 521.8921 549.6610 575.9049 579.8598 585.4468 594.0256 605.8768 632.8479 659.9045 670.8377 706.5803 719.5757 729.2839 743.2137 752.9383 766.4087 772.7705 790.7747 828.5795 861.8415 900.2688 911.1325 934.0531 944.8154 967.0299 980.9982 1005.0987 1015.9112 1028.0912 1033.7501 1037.7480 1041.6876 1046.6984 1050.3891 1097.8997 1106.6482 1114.3325 1115.3486 1135.9000 1150.7604 1171.5532 1186.5118 1208.9232 1220.8184 1242.0099 1252.7223 1255.4328 1304.1774 1311.2895 1315.3747 1326.1831 1360.7979 1381.4514 1396.8639 1408.7490 1420.5780 1425.0960 1440.2172 1447.9508 1453.9063 1454.4611 1456.8616 1462.8650 1475.8412 1481.9090 1490.7094 1575.2697 1589.3568 1599.6715 1613.1699 1630.2172 1658.6766 2971.1146 2994.9867 3002.1748 3024.6798 3044.6757 3055.0783 3085.9814 3100.7258 3102.4828 3115.7214 3129.4157 3132.3387 3142.8271 3149.7456 3156.8254 3172.3689 3545.4001
redmass: 1.0867 9.0754 8.2587 6.5901 11.0873 7.5484 7.0028 8.1560 6.4083 3.6341 4.0319 4.1863 1.1514 4.6363 5.9010 4.6783 1.4319 2.9423 3.3866 7.2604 8.4471 5.3616 7.2379 4.6576 5.8946 5.2741 3.1685 3.4432 7.1225 4.6172 6.5902 9.0636 7.0610 6.4072 3.3620 6.8795 7.2675 4.2092 4.7480 3.7548 4.4716 5.0851 4.0178 1.8771 3.6956 5.2904 6.7631 7.0448 6.0872 6.8983 3.3442 1.7908 4.4026 6.1460 3.7664 5.1834 1.4869 3.1214 6.7828 4.4284 1.5065 1.6663 1.3321 7.1361 6.7991 8.1126 1.6414 1.5928 2.3218 6.7757 1.5207 4.0653 2.3724 1.2979 2.1662 2.6215 1.5559 1.0699 2.6476 2.7526 3.6091 2.5136 1.3455 2.0995 3.0419 2.3947 1.7358 1.9792 1.6143 4.0630 1.2440 1.1919 1.1998 2.0669 1.1917 1.0525 1.0553 1.0896 2.3594 1.0540 1.3313 1.3916 1.0796 6.1202 7.5682 6.8174 7.7161 5.0356 7.1964 1.0402 1.0404 1.0296 1.0578 1.0973 1.0840 1.0974 1.1053 1.1042 1.0965 1.0850 1.0957 1.0897 1.1044 1.0949 1.0998 1.0773
irintensity: 0.1357 0.6309 0.6007 0.5645 1.0203 0.9038 2.9525 2.0226 0.4815 0.3206 1.0147 2.7010 0.4123 0.4437 3.6444 1.6638 0.8559 1.0214 1.4572 8.9875 1.4176 0.2338 7.2005 0.8272 3.4196 1.6201 8.4468 9.2154 3.4563 1.4115 5.4346 9.9588 8.7755 3.6271 4.4501 0.6899 29.1283 2.2315 4.0575 5.2937 19.1056 1.6127 4.7082 45.1779 4.3434 13.6943 30.0524 11.5855 2.1417 16.0253 17.7562 55.2524 8.9209 52.5531 5.3903 13.4564 1.4409 107.7014 8.0893 54.5056 10.9654 8.3375 0.0457 337.4665 32.6426 367.6321 36.9227 15.5237 5.2739 81.6460 15.8097 156.8296 62.3781 1.4041 16.3225 37.0592 66.0472 0.4390 4.9963 377.6021 65.3104 9.8136 47.6603 33.4102 2.0393 70.0975 42.9474 5.0303 81.4446 1.5475 80.7323 71.2313 38.9823 17.8715 201.7118 12.7714 12.3939 20.1057 34.9089 8.9043 83.2702 225.5764 43.3634 8.8591 285.3433 3.5125 33.4266 120.2060 237.6946 34.8964 26.4743 41.6872 52.0472 15.2266 3.9700 15.2034 2.2219 25.5549 4.6721 1.4487 5.5208 10.6019 9.8780 16.3644 17.3610 46.6263
temp: 298.150 k
press: 1.00000 atm
elementType: 17 9 9 9 8 8 8 8 7 6 6 6 6 6 6 6 6 6 6 6 6 6 6 6 6 6 6 1 1 1 1 1 1 1 1 1 1 1 1 1 1 1 1 1
symmnumber: 1
zpe: 838864.2 jmol-1
zpe.correction: 0.319506 hartree
zpe.thermalcorrener: 0.345962 hartree
zpe.thermalcorrenthalpy: 0.346906 hartree
zpe.thermalcorrgfe: 0.259447 hartree
zpe.sumelectzpe: -1809.373354 hartree
zpe.sumelectthermal: -1809.346898 hartree
zpe.sumelectthermalent: -1809.345954 hartree
zpe.sumelectthermalfe: -1809.433413 hartree
dipole: 0.9596 4.2731 1.5484
dipole: 4.6451
quadrupole: -180.4891 -143.7725 -151.0029
quadrupole: -10.5293 6.0233 2.3032
quadrupole: -22.0676 14.6490 7.4186 -10.5293 6.0233 2.3032
hfenergy: -1809.69286 hartree
pointgroup: C01 [X(C18H17Cl1F3N1O4)]
dipole: -0.7646913 1.2418244 -1.1013663 debye
polarizability: 244.7520594|8.0269941|242.4139889|9.3324379|-31.7464753|215.3847448 unknown
InChI: InChI=1S/C18H17ClF3NO4/c1-9-13(16(24)26-3)15(11-6-4-5-7-12(11)19)14(10(2)23-9)17(25)27-8-18(20,21)22/h4-7,15,23H,8H2,1-3H3
charge 0 multiplicity 1
44 atoms
Cl -0.764738 -2.673303 2.161704
F  4.537471 0.419243 -0.255546
F  5.885253 1.250461 1.379524
F  4.849356 2.654695 -0.075395
O  2.286863 1.817831 0.899761
O  -3.378003 -0.935448 1.394047
O  1.377289 -0.121026 1.851566
O  -4.857056 0.259268 0.061532
N  -1.244605 2.279916 -1.379884
C  -1.072858 0.064376 0.409933
C  0.073779 1.077441 0.207578
C  -2.41668 0.639218 -0.080555
C  -0.75619 -1.268098 -0.306372
C  -0.019027 2.090674 -0.737219
C  -2.453916 1.66706 -1.002648
C  1.246176 0.828654 1.041108
C  1.054421 3.067778 -1.170585
C  -3.667567 2.282255 -1.662987
C  -3.667094 0.020096 0.414395
C  -0.595554 -2.513025 0.349248
C  -0.60495 -1.272022 -1.720497
C  -0.295059 -3.702009 -0.349027
C  -0.306928 -2.445296 -2.441642
C  -0.149307 -3.669048 -1.752063
C  3.510137 1.552649 1.654324
C  -4.537137 -1.648036 1.968935
C  4.674843 1.467384 0.675909
H  -1.151613 -0.161245 1.486192
H  -1.299263 3.019735 -2.081646
H  0.725845 3.637996 -2.059372
H  1.99728 2.553235 -1.408753
H  1.289551 3.78159 -0.363435
H  -3.502412 2.382096 -2.753721
H  -3.859815 3.294385 -1.256712
H  -4.559751 1.669185 -1.482751
H  -0.72677 -0.326217 -2.260216
H  -0.175217 -4.63863 0.203503
H  -0.197164 -2.407681 -3.530823
H  0.085314 -4.59118 -2.294369
H  3.42104 0.603272 2.21304
H  3.690723 2.390793 2.347176
H  -4.094649 -2.366924 2.672321
H  -5.102934 -2.162301 1.17393
H  -5.205582 -0.938497 2.485792
