program: Gaussian 09
title: 000173169
version: EM64L-G09RevD.01
frameworkgroup: C1[X(C26H22O)]
method: RPBEPBE
basis: SDD
operation: Freq
keyword: #pfreq=noraman
keyword: PBEPBE/SDD
title: #p freq=noraman PBEPBE/SDD
converged: YES YES NO NO
title: Mulliken charges:
elementType: O C C C C C C C C C C C C C C C C C C C C C C C C C C H H H H H H H H H H H H H H H H H H H H H H
charge: -0.264829 0.486440 0.486462 -0.408945 -0.408932 0.353791 0.353800 -0.410491 -0.411009 -0.389870 -0.389485 0.338988 0.339017 -0.399165 -0.399092 -0.399571 -0.399523 -0.396673 -0.396635 -0.398124 -0.398083 -0.235247 -0.235273 -0.235356 -0.235369 -0.241984 -0.241994 0.184743 0.187886 0.184757 0.187917 0.229645 0.229617 0.232088 0.232135 0.237803 0.237777 0.238191 0.238155 0.239905 0.239870 0.238525 0.238496 0.225431 0.225429 0.225110 0.225109 0.229280 0.229283
chargesum: 0.00000
title: Mulliken charges with hydrogens summed into heavy atoms:
elementType: O C C C C C C C C C C C C C C C C C C C C C C C C C C
charge: -0.264829 0.486440 0.486462 -0.036315 -0.036258 0.353791 0.353800 -0.180846 -0.181392 -0.157783 -0.157350 0.338988 0.339017 -0.161362 -0.161315 -0.161381 -0.161368 -0.156768 -0.156764 -0.159599 -0.159587 -0.009817 -0.009844 -0.010246 -0.010261 -0.012704 -0.012711
polarizability: 4.24097435e+02 8.32798331e-02 2.46491319e+02 -1.73586656e+01 -1.72531710e-01 2.47293503e+02
1716.lowfreq: -12.8736 -6.3429 -0.0007 -0.0005 0.0004 4.8251 5.0412 9.1193 13.2361
frequency: -12.5755 4.9373 13.2078 25.3203 38.8994 67.7443 67.9444 72.3095 99.0899 110.4647 117.4993 135.0422 175.1239 208.8812 246.7101 285.0379 294.8883 307.9497 339.5497 355.5879 379.1531 403.4861 403.6635 408.6765 408.8066 416.8601 448.2067 496.9418 509.8693 549.6283 553.0724 600.8612 605.7375 615.1539 615.4384 638.7358 638.9633 701.8127 701.9138 702.5890 717.2117 734.4581 741.4265 767.4639 772.2211 809.0145 828.2885 839.9592 845.9846 846.3548 849.7593 851.4867 852.8557 910.4517 919.2359 920.9082 957.2958 960.9269 966.4477 970.2071 970.4942 973.4071 973.4490 977.9341 988.7144 988.7308 991.7626 993.6069 994.2984 997.4336 997.5336 1018.4829 1018.5193 1040.8607 1040.9435 1085.1219 1085.1757 1121.9109 1124.8175 1173.3402 1173.3492 1179.1561 1189.4482 1189.6159 1193.8983 1199.5906 1200.5645 1231.4584 1236.4546 1290.0933 1290.1967 1303.8876 1303.9023 1317.4358 1317.5447 1323.2907 1366.2783 1367.2517 1376.6247 1377.0797 1393.4608 1411.2982 1411.3758 1439.4351 1439.5378 1472.7713 1478.2011 1478.4993 1483.1400 1519.6114 1520.0460 1570.9402 1571.3846 1590.1511 1590.2972 1613.3499 1613.4172 1624.5427 1625.2919 2914.6276 2922.8876 2964.3424 2968.6465 3121.3756 3121.4493 3122.1225 3122.1502 3124.0427 3124.1238 3127.2916 3127.3165 3140.1116 3140.1255 3144.3892 3144.4926 3148.8965 3148.9276 3151.0436 3151.1358 3164.8135 3164.8535
redmass: 3.7683 3.8739 6.2216 4.4136 6.0953 3.6832 3.6717 5.6783 5.1391 3.7157 3.8097 5.2060 6.0996 5.3425 5.2090 4.5880 3.1130 3.4759 3.7824 4.8770 3.4929 2.8371 2.8396 2.8679 2.8515 3.9875 4.7598 3.4404 3.7018 3.4477 2.7549 3.5462 5.7046 6.4572 6.3000 6.6869 6.7320 1.8100 1.7481 4.4468 4.2607 3.8950 2.8854 1.8377 2.1367 3.9604 1.8283 3.0654 1.3076 1.2583 1.3173 1.3788 1.6921 2.8191 1.4424 1.6670 1.4407 1.4711 1.5991 1.4025 1.4155 1.4428 1.4429 7.1994 4.9786 4.9683 1.5327 1.3142 1.4004 6.4114 6.7431 2.7069 2.7378 1.8880 1.8845 1.6096 1.6088 1.3632 1.3495 1.0521 1.0521 1.0494 1.1072 1.1080 1.1289 1.1263 1.1178 2.5041 2.4164 3.0800 3.1105 1.4114 1.4125 1.3157 1.3172 1.2467 2.7943 2.8104 9.5787 9.3867 1.4361 3.7091 3.7121 2.4043 2.4062 1.1091 2.2144 2.2043 1.1018 2.9686 2.9890 5.9930 5.9685 6.6106 6.6211 6.0734 6.0682 6.4646 6.4798 1.0558 1.0548 1.1053 1.1073 1.0872 1.0870 1.0851 1.0850 1.0871 1.0871 1.0874 1.0874 1.0920 1.0920 1.0958 1.0959 1.0961 1.0961 1.0968 1.0968 1.1016 1.1016
irintensity: 0.0059 0.0232 0.0203 0.0006 0.4686 0.0149 0.1016 0.4506 4.4976 2.2817 0.0871 0.1791 0.0284 0.0569 1.2861 1.1208 0.0469 2.0971 0.0001 0.0251 6.6456 0.1590 0.6377 0.0939 0.0031 2.4196 6.8393 19.6729 4.6659 3.2951 3.1589 3.9875 0.0001 0.0006 0.0680 0.0198 0.2983 54.8231 41.4409 2.2637 1.3183 9.2829 18.5898 102.5555 67.1240 1.9052 60.3527 1.6537 0.4603 4.7293 10.1973 0.0978 61.0034 0.4941 3.3169 1.7669 24.3095 0.2566 0.1101 0.4421 9.6097 0.1653 0.1927 279.1882 3.2043 0.1860 5.9571 0.0956 1.3985 5.4310 5.9769 0.1241 2.4150 3.2553 2.8201 6.3511 10.4229 0.0145 11.2065 0.0047 0.0356 0.3308 0.0673 0.5491 7.3430 5.9453 0.0107 12.8908 4.5392 0.0195 0.2855 0.4446 5.2696 9.1361 0.1150 107.4881 0.1099 3.6875 0.0512 0.0666 17.7232 2.0642 10.7788 2.6115 5.7058 0.5517 52.1612 20.7438 2.0811 3.0418 1.3158 0.1082 3.2986 0.4940 1.4065 10.6226 3.2723 6.9947 12.5270 15.2576 170.1015 83.0432 0.3347 4.9060 20.9668 12.2665 10.8507 19.4042 10.7035 1.1085 2.7468 17.9587 10.5645 4.3418 25.8140 21.1876 84.2951 1.5792 1.9694 38.7627 17.5098
temp: 298.150 k
press: 1.00000 atm
elementType: 8 6 6 6 6 6 6 6 6 6 6 6 6 6 6 6 6 6 6 6 6 6 6 6 6 6 6 1 1 1 1 1 1 1 1 1 1 1 1 1 1 1 1 1 1 1 1 1 1
symmnumber: 1
zpe: 1040256.4 jmol-1
zpe.correction: 0.396213 hartree
zpe.thermalcorrener: 0.418016 hartree
zpe.thermalcorrenthalpy: 0.418961 hartree
zpe.thermalcorrgfe: 0.340324 hartree
zpe.sumelectzpe: -1077.327320 hartree
zpe.sumelectthermal: -1077.305516 hartree
zpe.sumelectthermalent: -1077.304572 hartree
zpe.sumelectthermalfe: -1077.383208 hartree
dipole: -0.0002 -1.2652 -0.0015
dipole: 1.2652
quadrupole: -143.5834 -148.9324 -140.6500
quadrupole: 0.0153 -3.9008 -0.0436
quadrupole: 0.8052 -4.5438 3.7386 0.0153 -3.9008 -0.0436
hfenergy: -1077.7235323 hartree
pointgroup: C01 [X(C26H22O1)]
dipole: -0.0000261 0.4977566 -0.0000239 debye
polarizability: 424.6869562|0.1011909|246.4909464|14.0264946|0.1731422|246.7043545 unknown
InChI: InChI=1S/C26H22O/c1-3-7-23(8-4-1)25-15-11-21(12-16-25)19-27-20-22-13-17-26(18-14-22)24-9-5-2-6-10-24/h1-18H,19-20H2
charge 0 multiplicity 1
49 atoms
O  -0.000033 1.933094 0.000934
C  2.426225 1.870281 -0.091644
C  -2.426274 1.869224 0.093474
C  1.218089 2.775943 -0.07008
C  -1.218531 2.775346 0.072818
C  4.708767 0.131244 -0.126033
C  -4.7084 0.129445 0.126055
C  3.027461 1.485017 -1.314886
C  -3.030216 1.486106 1.316054
C  2.979924 1.374257 1.114856
C  -2.977073 1.370578 -1.113302
C  5.900715 -0.765023 -0.141386
C  -5.900094 -0.767166 0.140483
C  4.148428 0.630733 -1.33373
C  -4.150952 0.631515 1.334016
C  4.098772 0.518981 1.099405
C  -4.095661 0.515001 -1.098732
C  6.102667 -1.701068 -1.193434
C  -6.104577 -1.700625 1.194355
C  6.870107 -0.707352 0.898341
C  -6.866853 -0.712396 -0.901856
C  7.231646 -2.54775 -1.205984
C  -7.233362 -2.547563 1.206141
C  7.999001 -1.553768 0.887892
C  -7.995573 -1.559048 -0.892165
C  8.186717 -2.479181 -0.164952
C  -8.185803 -2.481842 0.162524
H  1.245337 3.452772 0.813282
H  1.177442 3.405682 -0.98652
H  -1.245927 3.453082 -0.809866
H  -1.178159 3.404214 0.98986
H  2.615587 1.86019 -2.259617
H  -2.620623 1.86325 2.2610
H  2.51762 1.647325 2.070931
H  -2.512632 1.641927 -2.068831
H  4.61478 0.37439 -2.291613
H  -4.619401 0.376995 2.291358
H  4.487827 0.123296 2.044303
H  -4.482347 0.117336 -2.04377
H  5.354158 -1.788056 -1.989308
H  -5.358119 -1.785498 1.992375
H  6.754367 0.026411 1.704229
H  -6.749332 0.0194 -1.709266
H  7.360756 -3.267584 -2.022171
H  -7.364383 -3.265359 2.023817
H  8.736669 -1.484945 1.695451
H  -8.73117 -1.492431 -1.701795
H  9.063083 -3.136677 -0.174102
H  -9.06205 -3.139503 0.171092
