program: Gaussian 09
title: 000173203
version: EM64L-G09RevD.01
frameworkgroup: C1[X(C14H24N4O5)]
method: RPBEPBE
basis: SDD
operation: Freq
keyword: #p
keyword: freq=noraman
keyword: PBEPBE/SDD
title: #p freq=noraman PBEPBE/SDD
converged: YES YES NO NO
title: Mulliken charges:
elementType: O O O O O N N N N C C C C C C C C C C C C C C H H H H H H H H H H H H H H H H H H H H H H H H
charge: -0.316088 -0.239972 -0.362057 -0.456191 -0.250976 -0.347496 -0.357141 -0.372092 -0.625401 -0.207731 -0.452276 -0.497577 -0.519446 -0.157112 -0.048725 -0.253190 0.252020 0.148561 0.293767 -0.696408 -0.705356 -0.401095 0.195317 0.269404 0.216308 0.248232 0.206913 0.264159 0.271087 0.264072 0.262166 0.198681 0.340612 0.281658 0.344601 0.370493 0.229249 0.212284 0.212601 0.213489 0.215357 0.216606 0.235408 0.222299 0.326082 0.374235 0.380671
chargesum: 0.00000
title: Mulliken charges with hydrogens summed into heavy atoms:
elementType: O O O O O N N N N C C C C C C C C C C C C C C
charge: -0.316088 -0.239972 -0.362057 -0.075520 -0.250976 -0.006885 -0.012540 -0.001599 0.074916 0.061674 0.012263 -0.026504 0.006791 0.113975 0.149956 0.028468 0.252020 0.148561 0.293767 -0.042274 -0.059905 0.056612 0.195317
polarizability: 2.05590456e+02 8.52641043e+00 2.14621391e+02 3.96515820e+00 -1.14843895e+01 1.51124436e+02
1716.lowfreq: -6.2344 0.0007 0.0008 0.0010 7.4218 8.5351 21.4395 25.5516 40.9792
frequency: 21.2611 25.4635 40.9736 42.3984 60.4396 64.3751 67.0289 77.1553 89.6094 93.6863 111.4269 117.6670 131.1419 173.8600 185.7817 203.1331 218.7327 233.4178 243.6436 258.4558 264.7507 276.1278 303.7492 333.8368 339.5507 350.8877 389.6763 404.2487 409.8129 425.7858 467.7871 499.7049 513.3831 541.0236 557.4657 587.9556 612.3901 618.1398 637.9024 643.8884 663.4147 698.1433 706.2766 719.7863 759.0441 778.7449 781.2758 791.0454 808.1144 823.1775 850.5397 856.2230 872.9748 881.6293 902.8560 921.5679 925.2181 950.5102 959.2677 963.7532 965.3517 1004.5287 1014.6773 1039.8912 1059.3980 1086.3676 1091.7521 1105.1589 1120.9786 1138.1371 1153.1900 1154.7836 1182.7841 1188.2748 1193.5581 1214.0109 1228.9622 1238.1190 1246.5993 1260.2326 1265.2702 1281.1888 1294.3301 1296.7421 1312.4671 1320.8031 1328.2336 1333.3082 1335.6230 1345.6092 1348.7104 1350.8829 1380.7439 1386.9890 1392.1090 1399.0954 1453.8531 1459.7736 1464.6715 1470.1632 1473.5011 1476.1274 1477.8413 1483.8245 1488.5695 1531.7909 1561.4893 1582.0993 1615.5473 1649.4973 1671.4407 2950.8940 2964.2691 2971.9852 2972.1820 2975.0689 2985.2460 3005.4613 3021.7615 3025.2933 3033.9860 3051.0074 3057.7464 3062.4028 3070.3052 3075.4040 3083.6151 3091.3319 3102.4284 3335.3866 3361.7311 3408.8400 3490.5515 3571.1546 3611.4794
redmass: 5.0001 5.0961 5.6847 4.3022 3.4926 2.9026 5.5995 4.5064 5.1337 5.2979 4.3242 5.5296 6.2738 4.0424 3.5723 3.0964 1.1808 2.8323 3.2434 2.2090 2.1096 3.5578 4.8094 3.3925 4.0926 4.8735 3.1207 3.2997 2.1326 3.4843 3.8338 1.8718 3.5267 3.3835 3.4400 3.2957 1.7241 1.8514 3.3026 1.2151 4.0394 3.5675 2.5642 1.2626 2.0263 1.5265 1.8611 2.1136 3.0845 2.3870 2.3873 2.7145 3.4227 3.5320 2.6405 1.2690 2.1721 1.9402 2.2416 1.7603 2.8499 2.2719 2.3947 2.0487 2.6590 2.2946 2.6026 1.8957 2.0636 2.3388 1.3046 2.1011 1.7939 1.3447 1.3055 1.5266 1.5781 1.7181 1.3328 1.4796 1.8059 1.4430 1.7083 1.5042 1.3561 1.4287 1.6560 1.5469 1.7312 1.5518 1.3781 1.7320 1.2123 1.1986 1.8636 1.2122 1.0881 1.1142 1.0605 1.0582 1.8016 1.1551 1.1369 1.0583 1.0569 1.7733 5.6665 3.0248 1.6288 5.4046 8.6756 1.0818 1.0351 1.0829 1.0400 1.0707 1.0747 1.0648 1.0821 1.0610 1.0640 1.0962 1.0992 1.0999 1.0990 1.0995 1.1025 1.1027 1.1021 1.0813 1.0589 1.0647 1.0779 1.0782 1.0941
irintensity: 1.2232 1.6363 0.7409 0.0999 0.4594 0.6115 4.0262 4.9476 2.2784 2.1009 7.4819 8.0872 7.8213 5.3790 10.7637 1.4817 1.4478 7.0749 8.3171 7.1791 3.4236 11.9726 10.9132 10.4106 1.4453 19.6899 3.6494 15.4771 1.9646 13.0126 7.5214 40.9195 12.1335 3.8469 31.4058 13.4022 181.9425 45.9673 27.8998 38.5670 62.4532 5.6127 52.1317 277.9175 65.3263 114.3107 49.4851 12.0677 1.7539 15.5101 9.3378 4.4696 17.8069 15.6698 1.8377 5.4457 2.6381 22.4117 10.2947 5.0249 1.8925 9.6315 10.6949 9.9169 20.8338 37.5326 3.6095 2.5890 4.9344 6.5079 1.5575 12.1487 6.9916 1.0677 62.1275 5.6242 4.7847 80.5913 7.1966 48.8757 47.6401 1.0917 2.4271 24.0898 17.9353 11.2006 8.9652 28.8370 12.5314 26.3118 22.1316 11.9354 12.7732 91.7044 28.6335 12.4564 7.5188 46.9628 3.1978 3.0345 178.5304 23.3150 49.8615 3.9851 25.1782 172.0907 90.2771 272.7304 70.6076 286.6026 414.1631 17.9931 40.2182 20.8606 19.1015 10.1195 29.5243 30.4560 26.8607 16.6384 18.1979 5.7719 40.5715 7.5293 70.5057 42.4984 9.0566 24.3091 28.0657 170.5131 143.6393 84.5865 66.5386 41.1137 65.5769
temp: 298.150 k
press: 1.00000 atm
elementType: 8 8 8 8 8 7 7 7 7 6 6 6 6 6 6 6 6 6 6 6 6 6 6 1 1 1 1 1 1 1 1 1 1 1 1 1 1 1 1 1 1 1 1 1 1 1 1
symmnumber: 1
zpe: 1019516.6 jmol-1
zpe.correction: 0.388313 hartree
zpe.thermalcorrener: 0.412810 hartree
zpe.thermalcorrenthalpy: 0.413755 hartree
zpe.thermalcorrgfe: 0.332197 hartree
zpe.sumelectzpe: -1141.291782 hartree
zpe.sumelectthermal: -1141.267285 hartree
zpe.sumelectthermalent: -1141.266341 hartree
zpe.sumelectthermalfe: -1141.347899 hartree
dipole: 0.7830 -5.6719 1.0723
dipole: 5.8252
quadrupole: -152.5550 -149.7702 -138.7321
quadrupole: -7.5480 -2.3411 13.1736
quadrupole: -5.5359 -2.7511 8.2870 -7.5480 -2.3411 13.1736
hfenergy: -1141.6800958 hartree
pointgroup: C01 [X(C14H24N4O5)]
dipole: -0.9013492 2.0163423 0.6118912 debye
polarizability: 201.7451957|5.5718936|216.0433068|-6.6441466|15.9038092|153.5477806 unknown
InChI: InChI=1S/C14H24N4O5/c1-7(2)5-9(12(15)21)17-14(23)10(6-19)18-13(22)8-3-4-11(20)16-8/h7-10,16-19H,3-6,15H2,1-2H3
charge 0 multiplicity 1
47 atoms
O  -0.70463 0.15153 -1.9276
O  -3.34049 -3.4100 -0.646828
O  2.036928 2.120731 1.141608
O  -0.169941 3.80573 1.437707
O  5.094423 -0.461984 -1.197006
N  -3.07585 -1.167104 -1.327863
N  -1.020185 1.747815 -0.281214
N  1.816875 0.52228 -0.547814
N  4.607843 1.345323 0.186352
C  -2.885828 0.17253 -0.773527
C  -3.337225 0.005608 0.723689
C  2.65872 -1.830697 -0.592233
C  -3.271243 -1.517439 0.998387
C  2.874843 -0.397994 -0.055581
C  1.929533 -2.7862 0.388735
C  0.259866 2.431188 -0.556746
C  -1.438392 0.669893 -1.017992
C  -3.247695 -2.181934 -0.389595
C  1.451137 1.669206 0.084059
C  0.502077 -2.305854 0.743397
C  1.888629 -4.215066 -0.201958
C  0.175959 3.861237 0.013124
C  4.299259 0.151845 -0.428356
H  -3.542411 0.905876 -1.284953
H  -2.711905 0.58296 1.424753
H  -4.373376 0.368376 0.82687
H  2.099662 -1.794116 -1.549998
H  3.65298 -2.242368 -0.844237
H  2.818437 -0.388712 1.05253
H  -2.349248 -1.814792 1.52961
H  -4.125814 -1.894379 1.582249
H  2.52618 -2.820131 1.326382
H  -2.841827 -1.379146 -2.299135
H  0.403941 2.450728 -1.653894
H  -1.536982 2.10631 0.529485
H  1.227359 0.219316 -1.343342
H  -0.127282 -2.261127 -0.166054
H  0.50955 -1.301001 1.207634
H  0.022967 -3.006108 1.453071
H  1.302273 -4.233293 -1.140605
H  1.41351 -4.922905 0.501698
H  2.905376 -4.586138 -0.428412
H  -0.638696 4.420134 -0.47586
H  1.13456 4.388831 -0.152789
H  5.517022 1.767991 -0.001748
H  3.922141 1.806807 0.801325
H  0.620573 3.377944 1.878175
