program: Gaussian 09
title: 000172943
version: EM64L-G09RevD.01
frameworkgroup: C1[X(C19H26N2O3S)]
method: RPBEPBE
basis: SDD
operation: Freq
keyword: #p
keyword: freq=noraman
keyword: PBEPBE/SDD
title: #p freq=noraman PBEPBE/SDD
converged: YES YES NO NO
title: Mulliken charges:
elementType: S O O O N N C C C C C C C C C C C C C C C C C C C H H H H H H H H H H H H H H H H H H H H H H H H H H
charge: 0.385037 -0.278800 -0.284611 -0.281947 -0.080592 -0.519997 -0.084754 -0.081723 -0.426172 -0.476993 -0.414416 -0.464086 -0.391883 -0.404373 -0.316987 -0.375694 0.193794 0.461941 -0.356561 -0.503435 -0.397775 0.243778 0.213056 -0.534562 -0.517793 0.203159 0.197934 0.194810 0.213024 0.210890 0.206630 0.194819 0.204000 0.209540 0.205138 0.183549 0.209520 0.206097 0.170892 0.210109 0.208269 0.238771 0.262075 0.281693 0.268982 0.228339 0.233630 0.243494 0.232293 0.214549 0.263342
chargesum: 0.00000
title: Mulliken charges with hydrogens summed into heavy atoms:
elementType: S O O O N N C C C C C C C C C C C C C C C C C C C
charge: 0.385037 -0.278800 -0.284611 -0.281947 -0.080592 -0.519997 0.118405 0.116211 -0.018338 -0.059473 -0.015597 -0.049408 0.001185 -0.027384 0.101391 0.125152 0.193794 0.461941 -0.356561 -0.221742 -0.128793 0.243778 0.213056 0.170901 0.192392
polarizability: 3.68687951e+02 -4.25680112e+00 2.40478920e+02 -1.42355500e+01 -2.50517432e+00 1.58467175e+02
1716.lowfreq: -8.4503 -3.8350 -2.8377 -0.0014 -0.0010 -0.0007 6.9604 11.9618 19.8267
frequency: 5.3966 11.8350 18.9529 29.1273 47.2785 50.8877 67.1627 82.8565 90.6973 118.0135 137.8199 154.6278 166.5842 182.9753 200.6161 206.9884 219.9506 243.6885 258.3984 269.5044 283.2496 299.5743 308.4657 322.8977 332.5331 350.5624 369.3079 377.4901 390.7345 414.9838 439.9334 454.9105 467.9299 498.2757 515.2380 548.7180 578.8202 589.2779 609.8741 664.9764 690.3066 714.5745 724.2143 741.8515 746.0701 748.9363 766.6610 778.4578 808.2083 813.2146 839.5947 864.4887 866.4154 885.0793 888.8705 904.1240 920.5066 959.0738 964.6842 970.6528 974.9886 986.1025 1003.0811 1029.5843 1050.8972 1062.9095 1085.6021 1088.4441 1110.3277 1113.5190 1113.5819 1121.6729 1137.3611 1142.3498 1143.9632 1159.9985 1164.2299 1168.9145 1179.6669 1205.1083 1212.1177 1227.8823 1232.9082 1234.4691 1242.6062 1266.5977 1270.6054 1284.8955 1302.9094 1305.8855 1312.5784 1316.7083 1318.7576 1323.5557 1327.9208 1343.4388 1351.0710 1355.5991 1365.5416 1376.2373 1385.1821 1388.6228 1400.5495 1428.0364 1440.8029 1448.9684 1453.1657 1453.2172 1460.9644 1465.6001 1467.9595 1468.3833 1469.0001 1474.9511 1477.4219 1480.5190 1481.3879 1489.2379 1573.4224 1594.6240 1612.3622 2823.6804 2834.4100 2891.6821 2959.3285 2965.7844 2967.5343 2968.7355 2981.3962 2982.3625 2986.0033 2997.3898 3005.6710 3013.4625 3013.7986 3023.3485 3024.7150 3028.1823 3041.8064 3056.2883 3058.9984 3082.9875 3094.0507 3128.7589 3135.1924 3161.4464 3167.4700
redmass: 2.5075 5.0087 5.4176 2.9983 2.6592 2.6474 4.1332 2.8892 2.7485 5.3501 2.1602 3.7886 3.4300 3.5859 3.1462 1.8167 2.3860 2.1867 2.4833 3.0286 2.4560 5.0133 3.6235 2.6093 3.7961 5.2069 2.8478 2.5407 5.1841 2.9290 5.2422 4.7253 3.7405 12.5014 3.4376 6.9711 8.3221 8.8933 4.9698 4.6109 4.4726 5.9541 4.6233 3.0476 3.3084 2.1235 1.3902 2.8257 1.5798 2.3283 3.5745 2.5594 1.5310 2.3562 1.5259 4.5255 2.0646 2.3386 2.1745 5.9113 2.4693 5.6122 2.3298 3.9259 2.8207 2.4732 1.6637 2.1175 1.2378 1.8950 1.2626 1.7769 2.4079 1.6298 1.8779 1.5863 1.1034 2.3709 2.4560 1.2269 1.3184 1.4274 1.2409 1.2853 1.3741 1.4553 5.3068 1.4761 1.3772 1.4124 1.7163 1.6914 1.5529 1.4740 1.4872 1.3887 1.3578 1.4254 1.3768 1.3436 5.5346 1.3866 2.9880 1.3727 1.0960 1.4403 1.1099 1.1109 1.0790 1.0500 1.5905 1.0924 1.0871 1.0833 1.1870 1.2057 1.0995 1.0872 10.2727 10.8987 7.4005 1.0715 1.0709 1.0694 1.0698 1.0764 1.0324 1.0610 1.0745 1.0345 1.0628 1.0744 1.0857 1.1003 1.0593 1.0891 1.0876 1.0986 1.1024 1.1016 1.1044 1.1038 1.0973 1.1004 1.1052 1.0910 1.0926
irintensity: 0.0015 0.2554 0.6034 0.2894 2.2762 2.4074 6.9990 0.8199 0.6118 2.3598 0.5102 6.1104 6.0798 2.7344 1.6979 0.1479 0.3832 4.3737 1.9596 4.0096 5.9333 0.5890 3.1265 7.1801 8.3090 1.8784 7.8785 2.4867 4.3942 1.0201 1.6037 8.9205 6.1908 0.3086 0.1986 16.0105 9.0283 9.8322 0.2061 5.3720 1.3750 9.1429 20.6496 2.2000 4.0048 12.0397 1.1410 1.6359 10.8096 14.8296 10.6306 0.5652 16.0945 0.0535 28.5643 6.1489 0.5202 5.2128 2.5549 105.3321 8.9255 27.0876 1.2107 4.8463 8.2685 11.5088 4.2883 15.8014 14.4030 11.0888 0.1749 2.4109 71.3330 33.1410 63.3430 37.7246 3.0492 45.3826 41.7576 8.8524 6.4290 21.9212 3.5285 6.1283 6.6667 4.2497 297.7701 24.8616 1.2265 11.7155 2.9009 37.6481 27.7964 5.0624 1.3970 1.4818 10.2166 0.7060 1.0566 4.0756 76.2880 0.6469 56.2629 25.8728 28.9543 26.0959 28.5473 25.8666 2.6033 14.6711 209.4459 7.8315 12.6799 7.9044 43.6245 4.2973 20.1859 6.6185 19.9506 191.9143 77.9495 69.1958 121.4018 86.9963 0.0788 4.3415 51.7149 0.8661 127.8482 97.6199 100.5209 112.5560 53.5961 4.2658 28.8180 19.3186 38.3660 4.8971 70.0175 97.4825 38.6812 6.6759 37.3690 23.7777 14.2378 3.5598 2.8536
temp: 298.150 k
press: 1.00000 atm
elementType: 16 8 8 8 7 7 6 6 6 6 6 6 6 6 6 6 6 6 6 6 6 6 6 6 6 1 1 1 1 1 1 1 1 1 1 1 1 1 1 1 1 1 1 1 1 1 1 1 1 1 1
symmnumber: 1
zpe: 1108343.4 jmol-1
zpe.correction: 0.422146 hartree
zpe.thermalcorrener: 0.446928 hartree
zpe.thermalcorrenthalpy: 0.447872 hartree
zpe.thermalcorrgfe: 0.362763 hartree
zpe.sumelectzpe: -1470.903791 hartree
zpe.sumelectthermal: -1470.879008 hartree
zpe.sumelectthermalent: -1470.878064 hartree
zpe.sumelectthermalfe: -1470.963173 hartree
dipole: -1.6339 -0.2800 0.0716
dipole: 1.6593
quadrupole: -124.2110 -151.6477 -160.0529
quadrupole: -10.6550 7.4733 3.4727
quadrupole: 21.0929 -6.3438 -14.7491 -10.6550 7.4733 3.4727
hfenergy: -1471.3259364 hartree
pointgroup: C01 [X(C19H26N2O3S1)]
dipole: 0.6423627 -0.1057947 -0.0483815 debye
polarizability: 369.0908531|6.1274418|233.6118414|-10.1022089|22.833686|164.931351 unknown
InChI: InChI=1S/C19H26N2O3S/c1-23-16-9-15-18(10-17(16)24-2)25-21(19(15)22)8-7-20-11-13-3-4-14(12-20)6-5-13/h9-10,13-14H,3-8,11-12H2,1-2H3
charge 0 multiplicity 1
51 atoms
S  0.967626 -2.00972 -0.085857
O  0.694017 1.732235 1.175845
O  6.024991 1.274462 0.018948
O  6.148852 -1.434562 -0.858196
N  -3.494662 -0.200254 -0.270299
N  0.208034 -0.485792 0.565952
C  -5.386169 1.176629 0.743841
C  -5.824991 -0.920765 -1.002569
C  -5.746373 -0.143121 1.474393
C  -6.460607 1.503072 -0.326392
C  -6.035569 -1.320297 0.481533
C  -6.658395 0.342732 -1.350533
C  -3.937749 1.143831 0.16949
C  -4.315628 -0.782915 -1.355981
C  -2.041464 -0.271978 -0.532124
C  -1.24061 -0.42507 0.787674
C  1.082283 0.598904 0.748624
C  2.452698 0.184119 0.378141
C  2.572484 -1.144685 -0.07863
C  3.592117 1.015831 0.440179
C  3.816517 -1.679234 -0.456825
C  4.846202 0.511603 0.046241
C  4.962892 -0.857098 -0.391266
C  5.913267 2.690048 0.387849
C  7.384938 -1.280939 -0.058678
H  -5.404918 2.00195 1.485339
H  -6.206766 -1.743761 -1.642403
H  -6.636933 0.04171 2.107452
H  -4.91743 -0.419334 2.150929
H  -6.187491 2.441461 -0.846944
H  -7.415076 1.705661 0.198201
H  -7.082152 -1.664759 0.601324
H  -5.383866 -2.180576 0.721696
H  -6.395434 0.674762 -2.373817
H  -7.727643 0.055798 -1.384172
H  -3.858896 1.892383 -0.662672
H  -3.237986 1.478937 0.957333
H  -3.907079 -1.792059 -1.558438
H  -4.227414 -0.198381 -2.310234
H  -1.655013 0.620273 -1.081608
H  -1.841402 -1.153596 -1.17017
H  -1.584048 -1.327243 1.324989
H  -1.398365 0.449921 1.442758
H  3.45185 2.045712 0.78211
H  3.946514 -2.708219 -0.80327
H  5.58104 2.806168 1.43722
H  5.213695 3.220929 -0.285342
H  6.927674 3.097987 0.269889
H  8.135252 -1.882126 -0.593765
H  7.233574 -1.686643 0.959846
H  7.691513 -0.225291 -0.003811
