program: Gaussian 09
title: 000172457
version: EM64L-G09RevD.01
frameworkgroup: C1[X(C14H14NO)]
method: RPBEPBE
basis: SDD
operation: Freq
keyword: #p
keyword: freq=noraman
keyword: PBEPBE/SDD
title: #p freq=noraman PBEPBE/SDD
converged: YES YES NO NO
title: Mulliken charges:
elementType: O N C C C C C C C C C C C C C C H H H H H H H H H H H H H H
charge: -0.215370 -0.052727 -0.429122 -0.504300 0.142787 0.289031 -0.115675 -0.116013 -0.330460 -0.325720 -0.176658 -0.176411 -0.137858 -0.236815 -0.219232 -0.206474 0.281993 0.281300 0.260585 0.260519 0.297623 0.297434 0.232966 0.283555 0.284090 0.284086 0.293434 0.246103 0.253671 0.253655
chargesum: 1.00000
title: Mulliken charges with hydrogens summed into heavy atoms:
elementType: O N C C C C C C C C C C C C C C
charge: -0.215370 -0.052727 0.134172 0.016804 0.142787 0.289031 0.181948 0.181422 -0.097494 -0.042164 0.107432 0.107675 0.155576 0.009288 0.034440 0.047181
polarizability: 2.53629538e+02 1.03803876e+01 1.35887076e+02 1.82739815e-01 1.41389679e-02 1.04965658e+02
1716.lowfreq: -11.1945 -0.0010 -0.0008 -0.0006 4.1898 5.1776 15.8690 24.2950 50.7679
frequency: 13.9316 22.7416 50.7609 52.2802 100.7213 140.4753 159.3106 202.8411 263.8855 352.0634 363.4700 395.4393 396.9011 414.8157 452.2891 509.6709 548.6876 573.4629 611.6948 643.1091 648.7707 689.6589 691.4239 750.8705 760.6696 777.3181 806.0222 837.9768 854.8709 864.5696 947.1197 951.1709 968.7123 987.3951 988.6586 996.4758 1015.1257 1015.5582 1022.7424 1022.9311 1026.4310 1051.0602 1061.9771 1085.6256 1093.0412 1155.5151 1167.8901 1182.2303 1188.3770 1193.6764 1219.6712 1225.7656 1267.9026 1293.4285 1322.7699 1344.7461 1355.1889 1371.9930 1393.3099 1438.9346 1442.6282 1458.4991 1476.3300 1482.4940 1487.3393 1559.8435 1572.0453 1591.7766 1609.6833 1625.0311 2993.0259 3050.6241 3058.3106 3126.2607 3132.4188 3146.2070 3156.5672 3166.6753 3177.5432 3178.8055 3186.2463 3192.1653 3201.8510 3208.8349
redmass: 4.0668 3.8436 5.0066 4.6661 2.6268 4.8257 3.7244 6.4756 4.7628 5.2691 2.4219 2.6847 2.7757 3.2190 5.2842 4.0082 6.4666 2.3298 6.4595 6.3251 6.3187 1.9451 1.8110 5.4325 1.4736 1.6615 1.5412 4.0868 1.2543 1.2653 1.3697 1.4212 4.2614 1.3993 6.2220 1.3860 5.1691 1.6232 1.6038 1.3674 2.1414 2.4433 3.3858 1.6049 1.6105 4.4912 1.1924 1.0641 1.0739 1.1226 1.1772 1.8851 1.1936 2.2016 1.3540 1.3491 1.5350 2.5762 8.3986 2.2294 1.1392 1.2414 2.2951 2.1352 1.5657 7.1233 5.8692 6.5966 6.0062 5.0857 1.0600 1.1014 1.0606 1.1072 1.0879 1.0880 1.0915 1.0965 1.0906 1.1016 1.0906 1.0958 1.0990 1.1037
irintensity: 0.2625 0.7267 0.4782 4.8783 1.2851 0.7113 0.4282 12.0774 10.4180 0.6797 0.0153 0.0101 0.0662 1.3198 0.1270 19.8953 13.4061 4.8950 1.0671 0.0676 3.5340 58.5720 47.3852 2.2671 62.9255 54.6777 4.4556 19.6457 1.4959 0.0005 1.6681 1.0525 65.6793 0.0001 11.4180 0.9780 0.3051 0.6142 0.3516 0.1285 0.7152 1.7999 0.1103 3.1003 8.1672 21.2902 1.7894 1.6577 0.1204 30.0064 0.1574 50.4190 0.7035 204.5624 28.7479 12.9948 1.0736 0.0168 3.5540 35.3620 0.7939 35.9632 52.9113 0.5051 17.8009 180.8278 0.6331 48.6852 24.0874 7.3094 6.1892 3.9750 6.9439 0.8795 8.6930 1.5407 6.4983 9.1098 0.0917 13.7685 0.4357 0.9386 3.8584 0.8160
temp: 298.150 k
press: 1.00000 atm
elementType: 8 7 6 6 6 6 6 6 6 6 6 6 6 6 6 6 1 1 1 1 1 1 1 1 1 1 1 1 1 1
symmnumber: 1
zpe: 643515.2 jmol-1
zpe.correction: 0.245102 hartree
zpe.thermalcorrener: 0.258889 hartree
zpe.thermalcorrenthalpy: 0.259833 hartree
zpe.thermalcorrgfe: 0.201130 hartree
zpe.sumelectzpe: -670.496303 hartree
zpe.sumelectthermal: -670.482516 hartree
zpe.sumelectthermalent: -670.481572 hartree
zpe.sumelectthermalfe: -670.540275 hartree
dipole: -10.8051 -3.3242 -0.0056
dipole: 11.3049
quadrupole: -4.6060 -89.2935 -80.9139
quadrupole: 2.2147 0.0438 -0.0459
quadrupole: 53.6651 -31.0223 -22.6428 2.2147 0.0438 -0.0459
hfenergy: -670.7414049 hartree
pointgroup: C01 [X(C14H14N1O1)]
dipole: 4.2582269 -1.2841804 0.0205226 debye
polarizability: 253.740579|-9.7261776|135.7692809|0.3167708|-0.4568404|104.9724132 unknown
InChI: InChI=1S/C14H14NO/c16-14(13-7-3-1-4-8-13)9-12-15-10-5-2-6-11-15/h1-8,10-11H,9,12H2
charge 1 multiplicity 1
30 atoms
O  -1.122311 2.178223 -0.035776
N  2.652863 0.42797 -0.006172
C  1.318996 1.127013 -0.013871
C  0.152097 0.120004 0.001241
C  -1.179652 0.911076 -0.013794
C  -2.462834 0.164332 -0.002653
C  3.246699 0.082793 -1.198652
C  3.257252 0.127019 1.192972
C  -2.518849 -1.258361 0.024108
C  -3.675463 0.912111 -0.019561
C  4.480156 -0.583325 -1.215626
C  4.490968 -0.538199 1.223505
C  5.116411 -0.900885 0.007447
C  -3.763851 -1.918028 0.033619
C  -4.916602 0.249612 -0.010159
C  -4.963309 -1.166095 0.016459
H  1.26715 1.76977 -0.907119
H  1.269514 1.794194 0.861372
H  0.191028 -0.523462 0.901234
H  0.193391 -0.552808 -0.876943
H  2.712709 0.362239 -2.109473
H  2.731362 0.44006 2.097545
H  -1.601147 -1.857213 0.037851
H  -3.615577 2.005096 -0.03983
H  4.932199 -0.840144 -2.176331
H  4.951564 -0.759434 2.1890
H  6.081405 -1.415272 0.012731
H  -3.805575 -3.011701 0.054262
H  -5.845816 0.827793 -0.02334
H  -5.929578 -1.681379 0.023854
