program: Gaussian 09
title: 000172425
version: EM64L-G09RevD.01
frameworkgroup: C1[X(C14H28O)]
method: RPBEPBE
basis: SDD
operation: Freq
keyword: #pfreq=noraman
keyword: PBEPBE/SDD
title: #p freq=noraman PBEPBE/SDD
converged: NO YES NO NO
title: Mulliken charges:
elementType: O C C C C C C C C C C C C C C H H H H H H H H H H H H H H H H H H H H H H H H H H H H
charge: -0.467196 0.429036 0.309085 -0.091014 -0.440733 -0.431628 -0.517566 -0.429584 -0.855766 -0.784075 -0.779783 -0.792068 -0.427295 -0.037598 -0.720802 0.176844 0.189879 0.186755 0.201799 0.188605 0.256203 0.185383 0.205029 0.195521 0.219423 0.219038 0.225865 0.226817 0.201028 0.228130 0.212285 0.206640 0.228932 0.208264 0.268427 0.204122 0.211118 0.219809 0.180636 0.231118 0.205756 0.215598 0.337961
chargesum: 0.00000
title: Mulliken charges with hydrogens summed into heavy atoms:
elementType: O C C C C C C C C C C C C C C
charge: -0.129235 0.429036 0.309085 0.085830 -0.064099 -0.041224 -0.075981 -0.029033 -0.191439 -0.128100 -0.131925 -0.111254 0.003631 0.143037 -0.068329
polarizability: 1.70870066e+02 -3.45896635e-01 1.45193583e+02 -9.46741195e-01 1.10734577e+00 1.38218902e+02
1716.lowfreq: -4.8974 -0.0002 0.0003 0.0007 5.8885 16.0112 40.6063 52.3039 81.9133
frequency: 40.5378 52.2595 81.9020 119.4902 138.8471 147.5313 167.1138 215.6068 225.0784 231.7083 247.6560 250.4085 266.3752 277.2541 284.8580 288.0877 311.1032 328.4460 358.8263 378.2865 389.6551 404.8322 420.4058 426.9025 449.3627 473.3857 485.1482 503.7870 516.9745 606.5336 627.3179 746.6989 768.2005 815.6942 822.3682 835.7536 867.2035 896.3776 907.0073 919.0255 927.3884 931.5428 943.4440 971.6371 982.8055 997.4090 1018.4310 1028.5464 1036.1935 1042.5274 1063.6485 1070.8795 1088.4314 1105.1526 1121.4189 1135.7841 1150.3050 1167.2134 1179.6168 1185.3189 1208.7510 1231.3553 1242.7181 1253.9067 1275.2659 1277.5349 1297.1182 1301.3591 1322.5295 1331.7947 1335.8925 1342.4609 1347.8714 1353.7608 1375.4303 1378.3027 1383.8288 1387.8317 1394.1508 1403.7758 1448.4301 1456.9733 1461.6419 1464.6010 1466.3685 1470.3926 1471.4864 1477.4450 1479.1938 1482.7348 1490.3152 1492.9664 1495.4102 1501.7836 1507.0247 2925.3205 2945.0771 2958.5618 2965.8939 2967.0770 2970.9383 2972.9176 2976.1194 2978.9606 2980.6896 2984.4010 2990.2576 3009.5448 3015.5752 3034.8039 3044.7687 3054.6949 3058.5020 3061.3696 3063.3739 3066.1226 3071.2639 3077.8584 3080.0102 3083.2316 3084.8437 3109.9015 3560.8340
redmass: 3.6763 3.3991 3.0151 2.4829 2.0228 2.5350 1.3215 2.9582 1.1824 1.2865 1.2058 1.4670 2.3697 1.3502 1.6827 1.4297 2.2411 2.1192 2.1648 2.0046 2.4838 2.3802 2.1412 2.5320 2.3826 2.5150 2.8268 2.5246 2.6819 2.1773 3.0012 1.8303 1.9014 2.5087 2.0337 1.5101 2.3636 1.7504 2.1549 1.7966 1.5688 1.6605 1.5744 1.6260 1.5266 1.4285 1.4685 1.7190 1.8823 2.9919 1.4802 1.4897 1.7075 2.1234 1.9212 2.3384 2.0606 1.5903 2.6375 1.7880 2.0666 2.1784 1.9077 1.2517 1.3765 1.4268 1.4787 1.1464 1.2929 1.3855 1.3571 1.4008 1.4096 1.4240 1.2540 1.4844 1.2605 1.2254 1.1991 1.1951 1.0803 1.0763 1.0646 1.0694 1.0623 1.0696 1.0468 1.0605 1.0672 1.0693 1.0507 1.0552 1.0547 1.0608 1.0586 1.0839 1.0784 1.0589 1.0646 1.0616 1.0369 1.0385 1.0441 1.0470 1.0459 1.0457 1.0582 1.0993 1.0986 1.1025 1.0956 1.0981 1.0969 1.0980 1.0976 1.0980 1.0951 1.0982 1.0981 1.0997 1.0996 1.0945 1.0661
irintensity: 1.2758 1.6274 0.7406 0.5433 2.3200 0.1555 1.0553 0.5479 0.3983 0.1451 1.2636 1.1039 0.0144 41.0969 48.8129 42.1399 5.6385 0.0919 0.3789 0.2741 2.2884 1.4668 3.7792 7.7634 4.0857 0.3008 0.5437 1.7665 1.7839 3.4294 0.0253 1.5952 1.1539 7.6670 10.4987 4.3397 4.5217 3.6619 2.0460 14.2169 0.0828 2.4075 1.7111 8.9315 8.8644 6.3482 5.3440 15.1366 2.3179 2.1191 17.3294 49.0173 1.4747 5.8959 0.3409 7.3616 4.9585 4.1624 4.1842 3.2030 7.2276 1.8526 7.2625 25.0576 4.8532 2.7942 0.4809 3.8130 6.5221 2.1651 0.2955 0.9880 2.6352 3.5151 2.6931 16.6949 35.7756 22.7772 31.2513 19.4742 3.3520 0.2862 2.2102 11.6313 5.4080 9.1528 7.8563 12.2051 7.6360 30.0828 1.6614 10.2757 5.6212 6.9900 0.6297 49.6972 28.6409 30.1774 19.8529 44.8006 31.5853 44.0682 22.4513 55.1690 52.6942 16.2702 35.2370 43.7565 62.4297 71.7345 11.6145 8.2467 48.5181 47.7965 71.2813 34.0726 32.3200 61.8776 29.1254 48.6607 23.3522 27.8131 5.2901
temp: 298.150 k
press: 1.00000 atm
elementType: 8 6 6 6 6 6 6 6 6 6 6 6 6 6 6 1 1 1 1 1 1 1 1 1 1 1 1 1 1 1 1 1 1 1 1 1 1 1 1 1 1 1 1
symmnumber: 1
zpe: 1029667.9 jmol-1
zpe.correction: 0.392180 hartree
zpe.thermalcorrener: 0.410104 hartree
zpe.thermalcorrenthalpy: 0.411048 hartree
zpe.thermalcorrgfe: 0.348623 hartree
zpe.sumelectzpe: -624.242010 hartree
zpe.sumelectthermal: -624.224086 hartree
zpe.sumelectthermalent: -624.223142 hartree
zpe.sumelectthermalfe: -624.285567 hartree
dipole: 1.7408 -0.9329 -0.3965
dipole: 2.0144
quadrupole: -86.3892 -98.5218 -96.9647
quadrupole: -2.9269 1.5547 -1.0383
quadrupole: 7.5694 -4.5633 -3.0061 -2.9269 1.5547 -1.0383
hfenergy: -624.6341902 hartree
pointgroup: C01 [X(C14H28O1)]
dipole: 0.6943099 -0.3213131 -0.2069202 debye
polarizability: 170.8861896|0.343708|144.637822|-0.6572289|2.1775502|138.7585396 unknown
InChI: InChI=1S/C14H28O/c1-11-7-6-9-13(3,4)14(11,5)10-8-12(2)15/h11-12,15H,6-10H2,1-5H3
charge 0 multiplicity 1
43 atoms
O  3.331526 0.357831 1.442237
C  -0.461401 -0.162251 -0.4835
C  -1.63458 -1.032708 0.188136
C  -0.626516 1.401477 -0.228011
C  -3.032799 -0.401395 -0.121271
C  -2.067197 1.891809 -0.549905
C  0.93008 -0.647423 0.040104
C  -3.138295 1.097071 0.225991
C  -0.492509 -0.37342 -2.032738
C  -1.477347 -1.168861 1.732792
C  -1.665193 -2.485528 -0.374154
C  -0.169558 1.959616 1.148595
C  2.166836 -0.003807 -0.631388
C  3.466746 -0.320239 0.127006
C  4.726986 0.16786 -0.60841
H  0.042095 1.884928 -0.972452
H  -3.802279 -0.980179 0.429617
H  -3.264381 -0.529083 -1.199158
H  -2.268917 1.791037 -1.635557
H  -2.14158 2.972763 -0.315454
H  1.010818 -0.46346 1.124668
H  1.000246 -1.746363 -0.099935
H  -3.013708 1.247659 1.316202
H  -4.149313 1.471817 -0.028326
H  -1.504066 -0.243405 -2.455303
H  0.168291 0.353813 -2.539286
H  -0.142233 -1.385096 -2.305654
H  -1.4144 -0.199471 2.251015
H  -2.351104 -1.711994 2.142358
H  -0.575985 -1.748887 1.999285
H  -0.701232 -3.009549 -0.238174
H  -2.437072 -3.071009 0.162063
H  -1.920766 -2.510192 -1.448025
H  -0.846281 1.681684 1.97505
H  0.850185 1.637293 1.421094
H  -0.163416 3.065867 1.098119
H  2.274927 -0.356353 -1.675049
H  2.068495 1.098221 -0.664897
H  3.536021 -1.420221 0.292386
H  4.677144 1.260055 -0.769702
H  5.645605 -0.054374 -0.031089
H  4.823933 -0.326586 -1.592902
H  4.157193 0.208256 1.968726
