program: Gaussian 09
title: 000172709
version: EM64L-G09RevD.01
frameworkgroup: C1[X(C21H26N5O)]
method: RPBEPBE
basis: SDD
operation: Freq
keyword: #p
keyword: freq=noraman
keyword: PBEPBE/SDD
title: #p freq=noraman PBEPBE/SDD
converged: YES YES NO NO
title: Mulliken charges:
elementType: O N N N N N C C C C C C C C C C C C C C C C C C C C C H H H H H H H H H H H H H H H H H H H H H H H H H H
charge: -0.261813 -0.130313 -0.126305 -0.129508 -0.091458 0.010702 -0.438947 -0.561311 -0.542426 -0.561442 0.113651 0.313203 -0.327217 -0.320592 -0.302822 -0.373700 0.176757 -0.451598 0.438830 -0.656962 -0.332437 -0.299576 -0.410269 0.146489 -0.345479 -0.308637 -0.144638 0.276431 0.277021 0.326281 0.248940 0.252369 0.264097 0.263897 0.266323 0.252122 0.326306 0.249164 0.279076 0.226739 0.289845 0.262750 0.259574 0.263630 0.244421 0.251200 0.257635 0.256210 0.241096 0.276353 0.265303 0.259270 0.281762
chargesum: 1.00000
title: Mulliken charges with hydrogens summed into heavy atoms:
elementType: O N N N N N C C C C C C C C C C C C C C C C C C C C C
charge: -0.261813 -0.130313 -0.126305 -0.129508 -0.091458 0.010702 0.114504 0.266279 0.251891 0.266150 0.113651 0.313203 -0.048140 -0.093852 -0.012977 -0.110950 0.176757 0.071606 0.438830 0.096294 -0.076227 -0.058480 0.131388 0.146489 -0.086209 -0.026875 -0.144638
polarizability: 9.54482551e+02 1.32277608e+01 2.46705002e+02 1.49742599e+01 -1.52113191e+01 1.43414721e+02
1716.lowfreq: -8.5264 -3.0733 -1.7793 -0.0014 0.0010 0.0024 9.4242 15.1288 24.0501
frequency: 9.3502 14.8449 24.0438 36.1471 40.4943 49.5571 58.0112 68.6707 88.5019 100.2319 119.5373 130.7078 134.8394 149.1317 174.3819 180.3783 196.6094 203.3521 217.1813 244.5732 257.5810 272.9962 288.6561 300.7908 308.0180 327.1550 344.4324 352.6026 367.3307 390.4821 397.6357 404.8838 417.8943 429.1597 436.9246 459.9471 480.3785 492.6719 494.5559 502.6557 534.3842 538.0762 572.3322 587.2290 620.0267 628.8425 651.9741 727.8923 739.6445 740.8762 755.5510 774.8178 787.5549 807.2418 822.8862 824.5256 840.7341 872.7585 889.8642 896.7029 898.4932 937.2158 937.2975 949.6498 966.6119 975.8381 979.5615 981.5272 987.7829 990.5413 1001.1494 1003.7746 1017.8533 1037.4148 1046.4360 1103.2428 1104.1542 1104.8263 1109.9874 1116.8343 1127.9657 1149.1336 1173.4922 1181.9565 1200.7731 1206.3483 1211.2266 1233.6726 1261.4351 1264.8065 1270.2475 1284.7781 1291.3023 1299.2028 1303.3237 1308.6922 1315.5561 1332.3602 1354.8290 1370.1099 1381.0488 1386.8212 1405.7418 1418.5135 1435.0850 1444.7123 1446.5356 1448.9253 1452.5089 1453.5696 1469.5230 1472.7305 1474.8285 1476.1697 1476.9675 1484.4140 1491.8210 1493.1426 1505.9860 1511.2837 1520.0106 1532.1024 1536.7894 1565.5907 1610.3573 1626.5921 2203.6236 2976.0202 3004.9409 3012.8166 3022.5644 3023.7980 3027.3969 3034.1993 3053.8487 3059.2533 3083.1607 3095.6348 3116.0919 3127.3273 3136.7715 3139.4439 3142.6918 3144.8454 3155.0703 3155.1870 3157.4047 3159.7141 3164.8416 3168.7414 3175.7119 3180.2581 3184.4599
redmass: 4.6624 4.6303 7.3987 3.9686 5.0351 4.1556 3.2729 3.9513 3.4479 4.1348 3.0217 2.2137 3.9590 6.3028 2.7255 1.9050 3.0007 1.6399 3.3397 3.8058 1.1011 1.1282 3.4092 4.0028 5.3406 4.8242 5.3545 2.1949 3.3561 4.2097 3.7861 2.9793 2.9307 2.1830 3.5928 5.0001 3.0574 3.2665 4.4335 3.8032 3.0029 3.7067 5.1353 2.5637 7.1554 7.1388 5.9707 4.6314 4.0804 4.4553 3.8080 1.2228 5.4235 1.2660 1.3802 6.4524 1.7141 1.5414 3.5860 6.4735 3.0140 2.9810 3.2762 3.7839 1.6869 1.3500 1.5172 2.8810 3.1859 1.3839 3.8713 2.9794 1.3433 1.7579 1.1952 1.3269 1.3780 1.2849 1.7064 1.3712 1.3995 1.7327 1.2331 1.3243 1.5286 1.9792 1.6758 1.9260 2.0075 2.7111 3.4659 1.3186 1.2610 1.5836 1.4384 1.7645 2.1526 1.6880 1.3418 3.6899 4.5923 2.1301 1.1338 1.1691 1.1264 1.1940 1.0596 1.3134 1.1129 3.1862 1.0885 2.7720 1.0456 1.0568 1.2916 1.7115 1.0527 1.2873 1.4953 1.1105 2.1139 4.2514 4.3575 5.5566 6.3453 6.3586 12.4364 1.0366 1.0591 1.0581 1.0320 1.0317 1.0335 1.0605 1.1018 1.1018 1.1051 1.1056 1.0981 1.0887 1.1051 1.1056 1.1051 1.1047 1.0887 1.0875 1.0889 1.1055 1.1051 1.0952 1.0961 1.0958 1.0955
irintensity: 1.9812 5.7411 3.3498 1.2330 3.0449 2.6849 0.5017 0.8488 3.0116 0.4584 0.0560 6.7457 10.7116 1.2425 8.4355 1.5679 5.0135 3.0052 1.3633 17.2483 1.1636 0.3624 0.9155 0.7882 3.8921 25.7002 14.0650 0.2791 0.7924 6.1470 2.0126 0.2162 10.9929 0.0996 0.3640 26.5644 15.1919 4.2809 19.0162 9.7222 14.6770 11.4421 6.6031 16.2653 3.8284 2.0727 17.7479 9.9247 4.9358 20.5656 6.8673 17.1533 18.2440 1.1312 10.4129 4.3327 72.0115 69.7236 302.0330 39.5169 4.8224 22.3028 36.7472 61.3717 4.8542 1.4774 0.5082 2.7072 2.2294 2.0335 3.3263 22.9325 0.2060 17.5442 0.8036 56.4885 4.4099 8.5445 14.3492 56.5731 17.0454 1049.1569 54.2578 0.9420 9.7300 296.9444 72.7695 28.7984 31.9706 2.5345 1847.6015 14.7174 26.6776 356.0363 4.5048 184.3307 309.1766 25.9440 98.9484 34.2424 32.1153 260.8105 30.7698 139.3054 50.2345 8.1003 10.1901 162.5074 19.5018 39.3846 3.8033 21.1106 9.1565 20.4643 41.0894 15.9828 32.3817 29.3424 22.7341 322.8721 40.0310 356.1496 29.7616 943.9061 740.1916 237.5607 13.8322 99.2358 1.8217 2.0758 4.0686 11.3478 57.6851 44.2243 19.6667 1.1664 1.2206 7.0171 20.0574 29.1945 0.8926 3.5288 6.4929 33.6183 2.7903 8.1144 0.1375 3.7802 26.3842 6.3689 14.9113 0.6650 18.4829
temp: 298.150 k
press: 1.00000 atm
elementType: 8 7 7 7 7 7 6 6 6 6 6 6 6 6 6 6 6 6 6 6 6 6 6 6 6 6 6 1 1 1 1 1 1 1 1 1 1 1 1 1 1 1 1 1 1 1 1 1 1 1 1 1 1
symmnumber: 1
zpe: 1144827.5 jmol-1
zpe.correction: 0.436042 hartree
zpe.thermalcorrener: 0.463227 hartree
zpe.thermalcorrenthalpy: 0.464171 hartree
zpe.thermalcorrgfe: 0.374831 hartree
zpe.sumelectzpe: -1162.537086 hartree
zpe.sumelectthermal: -1162.509901 hartree
zpe.sumelectthermalent: -1162.508956 hartree
zpe.sumelectthermalfe: -1162.598297 hartree
dipole: 19.5573 0.7644 -0.2461
dipole: 19.5738
quadrupole: 130.6461 -154.0452 -154.8561
quadrupole: 80.4133 -6.1557 -1.8412
quadrupole: 190.0645 -94.6268 -95.4377 80.4133 -6.1557 -1.8412
hfenergy: -1162.9731274 hartree
pointgroup: C01 [X(C21H26N5O1)]
dipole: -7.6853953 0.3359446 0.3550716 debye
polarizability: 952.1599019|-9.9288297|151.0506976|-44.3452353|-30.8573896|241.391674 unknown
InChI: InChI=1S/C21H26N5O/c1-25(15-5-14-22)20-12-10-19(11-13-20)24-23-18-8-6-17(7-9-18)21(27)16-26(2,3)4/h6-13H,5,15-16H2,1-4H3
charge 1 multiplicity 1
53 atoms
O  -6.033484 -0.742852 1.96175
N  -7.960831 0.072062 0.02444
N  6.521967 -0.267877 0.33608
N  0.129977 -0.036218 -0.015574
N  0.909656 -0.415732 0.992841
N  8.443182 -0.121517 -4.196432
C  -6.454591 0.174606 -0.273031
C  -8.342753 0.936914 1.232747
C  -8.712629 0.584594 -1.203754
C  -8.371723 -1.383326 0.282125
C  -5.521268 -0.308019 0.875414
C  -4.079906 -0.230238 0.63144
C  -3.194354 -0.659279 1.674128
C  -3.516215 0.250803 -0.593512
C  -1.809873 -0.612031 1.508235
C  -2.128465 0.298101 -0.764486
C  -1.251962 -0.1294 0.279051
C  7.182479 0.174548 -0.90507
C  5.139686 -0.29773 0.460334
C  7.38236 -0.748304 1.437555
C  4.524726 -0.724134 1.688838
C  4.273348 0.096423 -0.626539
C  7.307446 -0.985078 -1.94693
C  2.283844 -0.34984 0.74216
C  3.135756 -0.745944 1.818635
C  2.888899 0.073983 -0.487511
C  7.935123 -0.523791 -3.194823
H  -6.271806 -0.420259 -1.185945
H  -6.250255 1.234828 -0.507328
H  -7.828922 0.536455 2.116428
H  -9.435451 0.891174 1.358515
H  -8.029263 1.974643 1.038819
H  -8.432233 1.632549 -1.390969
H  -8.451738 -0.035679 -2.075004
H  -9.794374 0.518403 -1.011645
H  -8.085249 -1.991911 -0.589881
H  -7.851639 -1.731021 1.184205
H  -9.463441 -1.414661 0.420543
H  -3.636836 -1.025701 2.60621
H  -4.152685 0.589767 -1.41917
H  -1.126974 -0.93646 2.297867
H  -1.67823 0.661117 -1.693426
H  6.635623 1.021852 -1.351048
H  8.189968 0.54738 -0.656099
H  8.435441 -0.706387 1.120836
H  7.147529 -1.793965 1.710595
H  7.271601 -0.116047 2.33842
H  5.140362 -1.029092 2.537762
H  4.695232 0.420712 -1.581826
H  6.306658 -1.396653 -2.174793
H  7.908722 -1.809718 -1.520886
H  2.665818 -1.066501 2.754005
H  2.237046 0.374953 -1.312898
