program: Gaussian 09
title: 000172374
version: EM64L-G09RevD.01
frameworkgroup: C1[X(C10H14O4)]
method: RPBEPBE
basis: SDD
operation: Freq
keyword: #pfreq=noraman
keyword: PBEPBE/SDD
title: #p freq=noraman PBEPBE/SDD
converged: YES YES NO NO
title: Mulliken charges:
elementType: O O O O C C C C C C C C C C H H H H H H H H H H H H H H
charge: -0.427889 -0.253152 -0.427599 -0.253930 -0.134399 -0.414934 -0.472976 -0.707149 -0.087729 -0.074614 -0.333555 -0.316710 0.161366 0.163957 0.234242 0.209849 0.209878 0.220392 0.232561 0.211737 0.232888 0.220983 0.268469 0.258952 0.263092 0.261763 0.377240 0.377268
chargesum: 0.00000
title: Mulliken charges with hydrogens summed into heavy atoms:
elementType: O O O O C C C C C C C C C C
charge: -0.050649 -0.253152 -0.050331 -0.253930 0.099843 0.004793 -0.020022 -0.041541 0.180740 0.184337 -0.070463 -0.054947 0.161366 0.163957
polarizability: 1.30049762e+02 1.82788241e+00 1.57750782e+02 1.74361108e+01 6.00628320e+00 8.95083070e+01
1716.lowfreq: -8.2197 -3.7727 -0.0010 -0.0006 0.0003 6.3092 17.6577 27.2999 35.0099
frequency: 17.1266 27.2179 34.9699 51.7583 76.7969 121.5441 141.7868 148.3662 153.7507 190.0047 214.0640 226.1859 286.6045 334.9235 353.0041 374.5496 396.8807 443.0115 498.9854 513.0596 590.6479 594.5890 599.0828 602.0636 687.9040 697.9833 786.7949 846.6600 858.7178 885.2102 902.5577 915.8460 920.6470 954.7787 999.5223 1007.4736 1010.1254 1036.8186 1055.2382 1073.0766 1078.0623 1100.6212 1160.7601 1187.9555 1199.1427 1232.6604 1245.9895 1277.0251 1280.2329 1287.4395 1307.3013 1316.5476 1333.7407 1354.0150 1359.5077 1383.3804 1458.9848 1459.9606 1471.2110 1478.7499 1638.4406 1640.1484 1659.7378 1663.1375 2965.9524 2976.1659 2979.2902 2992.3917 3033.0215 3049.5110 3071.4767 3077.7326 3086.0629 3088.9108 3153.3854 3156.6002 3522.2842 3523.9684
redmass: 7.1688 6.4031 7.0383 5.3188 5.6363 4.3355 3.5520 3.4562 2.8451 2.5869 1.1756 2.6218 2.9173 3.2104 4.5415 2.7106 2.5535 3.0686 3.0687 2.7539 1.5101 4.3115 1.4020 2.4654 2.8064 4.0165 2.1579 1.7597 2.0723 2.0858 3.0919 3.1795 1.8897 1.8052 1.2476 1.4876 1.5122 2.0617 1.9618 2.4565 1.6763 2.2022 1.9592 1.3138 1.3570 1.4526 1.5055 1.3937 1.2522 1.2445 1.6017 1.6344 1.4003 1.7512 1.6448 1.2023 1.0796 1.0988 1.0479 1.0589 8.6091 8.5959 6.2731 6.2156 1.0622 1.0376 1.0593 1.0841 1.1008 1.0973 1.0983 1.0914 1.0999 1.0910 1.0929 1.0929 1.0640 1.0640
irintensity: 0.4019 0.0543 3.1069 0.3747 0.2316 0.4145 0.9721 0.0831 2.0943 0.8056 0.1277 2.0784 0.2829 2.8347 9.7446 1.7535 3.8962 2.8740 32.2787 9.2543 113.7071 33.1796 90.5013 17.3196 81.1093 49.9115 5.9580 7.8312 6.6005 14.6528 4.4067 12.4893 4.6174 101.3837 57.6668 27.4448 25.8798 226.8082 219.9370 12.3295 154.9558 5.1091 7.2389 30.2049 1.8275 1.8561 2.4983 8.2169 13.9171 9.2919 3.3678 27.5190 5.6920 18.1149 99.8222 9.0911 4.5259 15.6955 12.9028 6.2145 507.2726 12.6924 61.2839 120.5583 17.3328 22.2081 50.2682 13.7207 15.9972 30.3772 24.9833 21.9884 28.6047 10.1901 9.3371 3.4180 38.1873 39.6907
temp: 298.150 k
press: 1.00000 atm
elementType: 8 8 8 8 6 6 6 6 6 6 6 6 6 6 1 1 1 1 1 1 1 1 1 1 1 1 1 1
symmnumber: 1
zpe: 585463.4 jmol-1
zpe.correction: 0.222991 hartree
zpe.thermalcorrener: 0.238696 hartree
zpe.thermalcorrenthalpy: 0.239640 hartree
zpe.thermalcorrgfe: 0.176907 hartree
zpe.sumelectzpe: -689.268534 hartree
zpe.sumelectthermal: -689.252829 hartree
zpe.sumelectthermalent: -689.251885 hartree
zpe.sumelectthermalfe: -689.314618 hartree
dipole: 0.1804 1.1250 0.0738
dipole: 1.1418
quadrupole: -99.4292 -71.4745 -83.7384
quadrupole: 4.0131 -4.8193 3.0407
quadrupole: -14.5485 13.4062 1.1423 4.0131 -4.8193 3.0407
hfenergy: -689.4915248 hartree
pointgroup: C01 [X(C10H14O4)]
dipole: -0.0801484 0.4416942 -0.0162167 debye
polarizability: 129.3859201|-2.9266055|157.9556732|18.3199893|-3.4397301|89.9672584 unknown
InChI: InChI=1S/C10H14O4/c1-8(6-7-10(13)14)4-2-3-5-9(11)12/h3,5-8,11,13H,2,4H2,1H3
charge 0 multiplicity 1
28 atoms
O  -2.637027 -2.88338 0.270747
O  -3.830498 -1.285497 -0.929911
O  3.514615 -2.165397 0.243438
O  4.207181 -0.02387 0.837808
C  -0.921571 1.726466 0.609071
C  -0.201872 2.443266 -0.57327
C  0.69271 1.506417 -1.433993
C  -1.680402 2.764352 1.481414
C  -1.890315 0.688533 0.09283
C  1.874978 0.968951 -0.668516
C  -1.855013 -0.642921 0.379137
C  2.191305 -0.348773 -0.525533
C  -2.870253 -1.566849 -0.170058
C  3.384374 -0.763835 0.242511
H  -0.155852 1.228137 1.235796
H  -0.961623 2.915455 -1.227841
H  0.416568 3.264799 -0.159289
H  1.070217 2.095719 -2.295867
H  0.089556 0.676828 -1.846419
H  -2.454044 3.289766 0.890071
H  -2.179041 2.277824 2.337967
H  -0.978377 3.522478 1.874819
H  -2.699213 1.050578 -0.563591
H  2.537212 1.706181 -0.18648
H  -1.085786 -1.081343 1.02359
H  1.586099 -1.146087 -0.969221
H  -3.334966 -3.479515 -0.114277
H  4.324537 -2.412385 0.766667
