program: Gaussian 09
title: 000172466
version: EM64L-G09RevD.01
frameworkgroup: C1[X(C20H23ClN2O2)]
method: RPBEPBE
basis: SDD
operation: Freq
keyword: #p
keyword: freq=noraman
keyword: PBEPBE/SDD
title: #p freq=noraman PBEPBE/SDD
converged: YES YES NO NO
title: Mulliken charges:
elementType: Cl O O N N C C C C C C C C C C C C C C C C C C C C H H H H H H H H H H H H H H H H H H H H H H H
charge: -0.062307 -0.263750 -0.275726 -0.073333 -0.277590 -0.354380 -0.370230 -0.396122 -0.386944 -0.398841 -0.353956 -0.465322 0.362409 0.329935 0.178259 0.167797 -0.328189 -0.335981 -0.324534 -0.333562 -0.109559 -0.271926 -0.254309 -0.239249 -0.246995 0.178195 0.205468 0.211413 0.171322 0.193624 0.205016 0.202428 0.193095 0.215120 0.189849 0.209057 0.237885 0.234771 0.247662 0.280191 0.242739 0.250573 0.243727 0.227387 0.230753 0.225030 0.257963 0.231137
chargesum: 0.00000
title: Mulliken charges with hydrogens summed into heavy atoms:
elementType: Cl O O N N C C C C C C C C C C C C C C C C C C C C
charge: -0.062307 -0.263750 -0.275726 -0.073333 -0.277590 0.029282 0.012505 0.002518 0.008579 0.006128 0.092986 0.017112 0.362409 0.329935 0.178259 0.167797 -0.047998 -0.093243 -0.073961 -0.089835 -0.109559 -0.046896 0.203832 0.018714 -0.015858
polarizability: 2.42109844e+02 -4.89983856e+00 3.26248540e+02 -2.59731749e+01 7.04540714e+00 1.86230965e+02
1716.lowfreq: -21.9125 -2.3687 -0.0015 -0.0014 0.0014 4.6209 9.0365 14.6462 23.9062
frequency: -19.8843 14.4208 23.6484 48.0584 65.6493 70.6142 102.3825 105.0759 137.5720 166.7434 182.4011 203.1777 209.4811 227.3727 231.2432 283.1229 299.8868 315.0936 320.1246 338.7638 352.5523 375.6440 381.9206 394.9531 403.9076 442.1832 448.6801 461.2110 492.4424 502.7659 522.3514 550.6332 564.3542 571.3366 595.4629 611.5105 625.7192 636.1699 680.9438 722.8646 730.7348 751.1826 753.6705 761.2396 790.7884 799.4804 805.6311 817.7585 841.7268 848.7324 854.6560 862.7066 876.3675 899.7910 913.6159 932.0735 939.2714 954.8281 967.5634 971.8418 991.5310 1019.3625 1040.7442 1044.7089 1048.4492 1058.2542 1073.9230 1079.6330 1100.0139 1108.1229 1114.0017 1123.0288 1124.7627 1148.2911 1155.9398 1158.6814 1175.4647 1183.5563 1193.6517 1222.8352 1232.8502 1240.5359 1251.5240 1259.6439 1265.0292 1271.3913 1290.8482 1299.3636 1309.3212 1329.7249 1338.2221 1340.9177 1347.0089 1353.4816 1358.2580 1369.1240 1373.6630 1374.8903 1393.3428 1401.2846 1440.1772 1449.8982 1450.6526 1458.6496 1460.5586 1464.7037 1468.6029 1473.3100 1479.7208 1488.8223 1503.5618 1565.0909 1574.2161 1590.7911 1614.8999 2825.4669 2835.1397 2888.8730 2967.4027 2984.4724 2986.1646 3011.3316 3022.3617 3027.0923 3030.6008 3036.3926 3042.9728 3045.7299 3055.1670 3099.1048 3099.8815 3133.8215 3146.0110 3152.9565 3165.4289 3168.5361 3181.1343 3183.9212
redmass: 2.9032 6.4393 4.6760 5.1134 6.5772 3.7386 3.6323 5.2220 4.0787 7.0940 5.2885 2.6925 4.0496 2.2671 3.4164 5.7947 3.4920 3.6157 2.6291 6.2040 3.8898 2.0940 5.2745 3.5909 3.1658 3.4278 2.8850 3.6584 3.9732 3.7056 4.3297 4.1044 2.6608 3.5316 5.8161 5.4189 6.7472 4.7931 5.8134 4.2035 3.7076 1.9188 1.7775 3.4033 1.4910 2.5830 1.7157 1.7397 1.4637 1.5094 2.5166 6.5440 1.4510 3.0452 3.0107 1.3785 1.3551 1.3091 1.4683 4.4798 2.6284 4.9885 3.5570 1.9993 2.1415 2.0383 2.3235 2.1746 1.6466 1.7618 2.0727 1.9847 1.8084 1.3234 1.5951 2.2545 2.0022 1.4763 1.5165 2.5388 1.1817 1.4435 1.5631 1.3121 1.1908 1.5005 1.3212 1.2807 1.5501 1.2943 1.4760 1.6430 1.5135 1.8445 2.2072 2.5868 2.0013 1.6794 1.3646 3.2473 2.3575 1.0920 1.2180 1.0879 1.0879 1.0998 2.5333 1.0944 1.1040 2.5698 1.1124 7.2486 6.8362 7.7342 6.9602 1.0717 1.0701 1.0705 1.0629 1.0613 1.0615 1.0525 1.0872 1.0851 1.0681 1.0946 1.0883 1.1033 1.1037 1.1154 1.0997 1.0858 1.0904 1.0892 1.0924 1.0972 1.0967 1.0946
irintensity: 0.1256 0.0208 0.0703 0.1879 0.1058 0.1122 0.1522 0.1816 0.2942 1.1703 0.4675 0.4721 5.4686 1.5699 9.5524 5.0402 1.5220 1.6043 2.6792 2.5811 1.2025 5.4248 2.3314 5.7014 5.5264 0.4353 0.0509 3.8383 9.4370 18.0025 0.3649 0.9812 1.6624 10.4370 10.7349 12.5044 21.5035 12.5942 4.9344 8.2163 3.3622 45.4888 38.8097 16.8270 11.1240 7.9851 12.2864 25.1659 5.3650 5.2388 6.6377 155.3275 27.9487 19.8376 10.0239 4.1613 2.7027 3.5191 5.5420 42.6310 17.9324 19.6434 9.2916 16.3254 12.7826 28.6268 14.2255 13.6450 6.5958 8.5428 28.6934 56.8892 15.9867 2.8707 25.0198 34.4508 71.1157 14.0136 64.6630 36.7964 5.8626 10.8546 0.5653 3.6080 3.5370 11.3946 5.3798 34.8131 46.1161 7.6110 16.0119 20.2714 3.9283 4.1761 3.2299 5.7834 22.2554 1.8933 2.7908 46.3890 12.2156 5.3232 9.7793 13.6174 14.8790 16.0154 290.8292 4.3589 9.6149 224.1033 17.7738 11.0749 1.7747 111.2276 50.9997 38.8949 131.8949 69.6252 38.5860 33.5988 30.9641 73.5600 51.4997 60.7409 21.8106 41.9377 19.6889 19.5987 93.9157 17.0511 25.6301 4.1133 11.9623 3.1724 1.9490 26.5334 1.7509 12.3138
temp: 298.150 k
press: 1.00000 atm
elementType: 17 8 8 7 7 6 6 6 6 6 6 6 6 6 6 6 6 6 6 6 6 6 6 6 6 1 1 1 1 1 1 1 1 1 1 1 1 1 1 1 1 1 1 1 1 1 1 1
symmnumber: 1
zpe: 1028161.0 jmol-1
zpe.correction: 0.391606 hartree
zpe.thermalcorrener: 0.412745 hartree
zpe.thermalcorrenthalpy: 0.413689 hartree
zpe.thermalcorrgfe: 0.340422 hartree
zpe.sumelectzpe: -1494.044239 hartree
zpe.sumelectthermal: -1494.023099 hartree
zpe.sumelectthermalent: -1494.022155 hartree
zpe.sumelectthermalfe: -1494.095423 hartree
dipole: 1.5183 -1.1861 1.8819
dipole: 2.6933
quadrupole: -146.4594 -152.1818 -154.8320
quadrupole: 2.3100 -9.8666 4.7513
quadrupole: 4.6984 -1.0241 -3.6743 2.3100 -9.8666 4.7513
hfenergy: -1494.4358446 hartree
pointgroup: C01 [X(C20H23Cl1N2O2)]
dipole: -0.5119719 0.4278568 0.8231615 debye
polarizability: 243.1402907|3.7533241|325.806177|24.8022824|11.0710492|185.642882 unknown
InChI: InChI=1S/C20H23ClN2O2/c21-16-8-9-20-18(14-16)23(13-12-22-10-4-1-5-11-22)17-6-2-3-7-19(17)24-15-25-20/h2-3,6-9,14H,1,4-5,10-13,15H2
charge 0 multiplicity 1
48 atoms
Cl 1.222798 -4.653142 -2.342726
O  1.967718 -0.46409 1.934792
O  3.420836 0.610462 0.329483
N  -3.189882 0.417397 0.089639
N  0.574494 0.217033 -0.552663
C  -3.71449 -0.972447 0.13676
C  -4.023627 1.338807 0.905388
C  -5.165144 -1.038641 -0.38251
C  -5.484586 1.346657 0.409386
C  -6.075083 -0.081711 0.42102
C  -1.746297 0.497436 0.40738
C  -0.887759 0.172181 -0.844145
C  1.165038 -1.070843 -0.304177
C  1.204357 1.483705 -0.443362
C  1.746578 -1.452013 0.938887
C  2.570648 1.693178 -0.065071
C  1.026483 -2.076843 -1.30009
C  0.478773 2.672184 -0.786473
C  2.13642 -2.782462 1.189718
C  3.169955 2.966675 -0.086208
C  1.418534 -3.397609 -1.029867
C  1.076648 3.946842 -0.793642
C  3.26699 0.202885 1.710136
C  1.96206 -3.784253 0.209889
C  2.4368 4.112793 -0.454858
H  -3.681327 -1.372276 1.18541
H  -3.065474 -1.623407 -0.477522
H  -3.59248 2.354653 0.83047
H  -4.007856 1.048505 1.989498
H  -5.533327 -2.080202 -0.310849
H  -5.175608 -0.750797 -1.451509
H  -5.506017 1.746984 -0.622844
H  -6.085265 2.024213 1.046377
H  -7.100789 -0.081089 0.006391
H  -6.149139 -0.439902 1.469004
H  -1.448354 -0.191681 1.234848
H  -1.514685 1.521808 0.749956
H  -1.155374 0.854903 -1.668817
H  -1.132442 -0.844205 -1.187905
H  0.630534 -1.809347 -2.283973
H  -0.573433 2.606413 -1.069037
H  2.561778 -3.028493 2.168131
H  4.227695 3.029756 0.191635
H  4.097658 -0.502349 1.888798
H  3.263174 1.056837 2.40879
H  0.467472 4.813569 -1.07335
H  2.24587 -4.821992 0.402583
H  2.910427 5.098916 -0.471272
