program: Gaussian 09
title: 000172313
version: EM64L-G09RevD.01
frameworkgroup: C1[X(C6H14O12P2)]
method: RPBEPBE
basis: SDD
operation: Freq
keyword: #p
keyword: freq=noraman
keyword: PBEPBE/SDD
title: #p freq=noraman PBEPBE/SDD
converged: YES YES NO NO
title: Mulliken charges:
elementType: P P O O O O O O O O O O O O C C C C C C H H H H H H H H H H H H H H
charge: 1.354201 1.389461 -0.388079 -0.509578 -0.446758 -0.466002 -0.511774 -0.494661 -0.644708 -0.653877 -0.671454 -0.705699 -0.610336 -0.591697 0.318660 -0.225618 -0.204583 -0.025088 -0.455913 -0.332094 0.309563 0.282022 0.291425 0.335377 0.282170 0.289615 0.232620 0.401319 0.399681 0.372645 0.405330 0.434406 0.435976 0.403449
chargesum: 0.00000
title: Mulliken charges with hydrogens summed into heavy atoms:
elementType: P P O O O O O O O O O O O O C C C C C C
charge: 1.354201 1.389461 -0.388079 -0.108259 -0.047077 -0.093358 -0.511774 -0.494661 -0.239378 -0.219472 -0.235478 -0.302250 -0.610336 -0.591697 0.318660 0.083945 0.077439 0.266337 0.161634 0.190141
polarizability: 1.79302925e+02 4.53827465e+00 1.46254188e+02 -9.70686350e-01 -2.28459350e+00 1.19940120e+02
1716.lowfreq: -7.9892 -0.0016 -0.0013 0.0011 1.5858 9.3872 27.9432 38.0186 45.3451
frequency: 27.4744 38.0109 45.2937 48.2356 75.7870 83.4029 113.6217 131.7459 144.2688 146.7599 172.7348 189.2236 202.7853 209.1831 217.4678 234.3380 257.8464 271.8839 275.7136 293.8977 316.7592 320.9811 325.8379 331.3450 338.0776 355.0240 363.1880 377.1779 384.6828 410.8541 415.5227 448.1348 467.9750 537.4291 544.9119 572.4254 594.4868 614.1801 651.7590 661.6795 674.0292 718.6774 740.5472 761.4992 773.6283 786.2526 795.5063 825.6655 838.7908 879.1057 932.2138 937.0104 953.5100 982.4794 986.2519 992.0461 1015.2957 1017.7984 1023.9974 1053.4322 1072.1290 1075.8384 1086.0976 1103.4264 1135.0864 1173.0906 1192.6199 1223.5640 1230.6700 1234.6553 1240.8415 1256.5830 1271.8211 1304.2196 1323.6112 1349.9281 1364.7832 1373.5194 1380.2554 1409.2960 1451.9665 1460.4734 3012.7901 3026.7945 3035.8070 3042.9828 3062.2440 3076.8760 3105.1996 3115.8501 3120.6078 3390.9676 3489.1469 3581.6387 3595.6671 3598.0849
redmass: 8.4660 9.3483 8.2318 7.4567 4.9808 3.4917 3.9211 7.3319 9.9921 5.5555 3.8794 5.2535 4.6591 3.3908 4.3369 2.8504 6.6565 3.0227 6.5371 4.1195 2.8226 3.2478 3.5104 1.8964 5.4956 5.9629 4.4516 7.3919 7.0013 3.5143 3.8019 5.2437 4.6188 3.8029 1.4497 6.0682 8.7769 3.0864 2.5185 1.4835 8.2111 9.4651 5.2474 1.4475 5.7275 6.7795 4.6010 1.4420 2.1821 2.7904 3.2673 5.5088 5.2444 2.0494 3.8979 1.5657 2.8348 2.0928 3.5365 3.4085 2.6497 3.1395 2.4184 2.4815 2.2257 1.3671 1.1615 1.2590 1.1806 1.1896 1.2584 1.2627 1.2714 1.2499 1.3234 1.3278 1.2371 1.3776 1.5294 1.5987 1.0758 1.0748 1.0874 1.0579 1.0592 1.0681 1.0882 1.0893 1.1056 1.0978 1.0788 1.0654 1.0654 1.0667 1.0662 1.0665
irintensity: 7.5650 8.1274 0.4070 1.3357 27.3839 37.0212 18.7663 15.1550 5.0200 8.7958 18.9107 10.2846 6.1159 29.0813 23.0934 24.9911 14.1719 57.2303 20.8983 34.3962 82.3258 18.1455 22.0891 85.0606 29.4352 6.5079 2.4470 22.0703 26.2471 31.5888 8.5950 4.9320 23.9100 26.6513 84.2791 4.6430 39.2156 61.9213 34.7274 100.1001 134.4372 173.7535 47.6904 83.3126 113.3539 227.0406 141.8799 50.4805 99.5404 209.3182 70.9158 186.3154 205.6044 8.9951 37.4055 32.4851 56.3989 39.2925 61.7221 6.4701 174.1706 120.8623 27.7767 49.2717 41.0298 41.2138 45.2163 209.2084 18.6372 62.9024 146.8975 39.1175 8.5825 18.2123 1.2059 4.3189 15.4682 68.2111 103.4400 35.2461 17.8885 11.7153 10.2559 13.6918 3.1480 700.0354 13.9133 8.4171 19.5922 108.3704 592.9559 123.3214 76.4608 24.9107 62.6944 103.4322
temp: 298.150 k
press: 1.00000 atm
elementType: 15 15 8 8 8 8 8 8 8 8 8 8 8 8 6 6 6 6 6 6 1 1 1 1 1 1 1 1 1 1 1 1 1 1
symmnumber: 1
zpe: 615293.1 jmol-1
zpe.correction: 0.234353 hartree
zpe.thermalcorrener: 0.257112 hartree
zpe.thermalcorrenthalpy: 0.258056 hartree
zpe.thermalcorrgfe: 0.182585 hartree
zpe.sumelectzpe: -1820.532707 hartree
zpe.sumelectthermal: -1820.509948 hartree
zpe.sumelectthermalent: -1820.509004 hartree
zpe.sumelectthermalfe: -1820.584475 hartree
dipole: 4.3576 5.3554 -3.1088
dipole: 7.5719
quadrupole: -168.3810 -118.5629 -135.1358
quadrupole: -9.5635 6.5450 8.7300
quadrupole: -27.6878 22.1303 5.5574 -9.5635 6.5450 8.7300
hfenergy: -1820.7670599 hartree
pointgroup: C01 [X(C6H14O12P2)]
dipole: -1.7505321 -2.1501354 -1.0895279 debye
polarizability: 179.2154862|2.8424212|145.9754055|5.4807219|-1.0279154|120.3063412 unknown
InChI: InChI=1S/C6H14O12P2/c7-4-3(1-16-19(10,11)12)18-6(9,5(4)8)2-17-20(13,14)15/h3-5,7-11,13-14H,1-2H2
charge 0 multiplicity 1
34 atoms
P  -3.373175 1.120214 -0.647317
P  3.733203 1.084899 0.130269
O  0.906007 -0.338587 0.850343
O  -1.399391 -0.362611 1.449166
O  -0.160162 -0.857259 -2.050353
O  -0.423614 -2.993644 0.965937
O  -1.714431 1.359502 -1.17318
O  3.711976 -0.645504 -0.098448
O  -4.107611 2.558255 -1.186537
O  -3.333785 1.360018 1.031676
O  2.80345 1.36232 1.516308
O  2.671637 1.644241 -1.143869
O  -3.976687 -0.233618 -1.222553
O  5.181787 1.703094 0.125153
C  -0.462571 -0.148927 0.34508
C  -0.659537 -1.255923 -0.747392
C  0.250605 -2.380811 -0.204735
C  1.480303 -1.639028 0.345597
C  -0.619342 1.290748 -0.171701
C  2.562359 -1.346714 -0.70632
H  -1.724901 -1.554081 -0.794307
H  0.498033 -3.124713 -0.981492
H  1.903128 -2.154953 1.223151
H  0.286474 1.581302 -0.725994
H  -0.802259 1.993213 0.659606
H  2.141471 -0.769089 -1.546553
H  2.991766 -2.295294 -1.073303
H  -1.309704 -1.315294 1.743923
H  -0.750083 -0.127862 -2.384938
H  -1.049314 -3.698789 0.663895
H  -4.950444 2.414424 -1.68778
H  -2.710526 0.685673 1.482162
H  1.959305 0.794895 1.520189
H  3.13053 2.208502 -1.817184
