program: Gaussian 09
title: 000172207
version: EM64L-G09RevD.01
frameworkgroup: C1[X(C16H26O2)]
method: RPBEPBE
basis: SDD
operation: Freq
keyword: #pfreq=noraman
keyword: PBEPBE/SDD
title: #p freq=noraman PBEPBE/SDD
converged: YES YES NO NO
title: Mulliken charges:
elementType: O O C C C C C C C C C C C C C C C C H H H H H H H H H H H H H H H H H H H H H H H H H H
charge: -0.236763 -0.217723 0.195223 0.248672 0.411174 -0.237476 -0.739032 -0.759940 0.334392 -0.391433 -0.387525 -0.714768 -0.714279 -0.271988 -0.274376 -0.712157 -0.691186 -0.689124 0.264398 0.243520 0.214033 0.239111 0.245806 0.206020 0.226172 0.251414 0.229138 0.230369 0.207290 0.209381 0.220195 0.214469 0.209321 0.225794 0.225479 0.232168 0.226765 0.208859 0.243520 0.197875 0.218958 0.212526 0.203654 0.242073
chargesum: 0.00000
title: Mulliken charges with hydrogens summed into heavy atoms:
elementType: O O C C C C C C C C C C C C C C C C
charge: -0.236763 -0.217723 0.195223 0.248672 0.411174 0.026921 -0.042368 -0.081942 0.334392 -0.140019 -0.158387 -0.067727 -0.070294 -0.046194 -0.048896 -0.044364 -0.030833 -0.030871
polarizability: 2.28317013e+02 -6.68100489e+00 1.88263383e+02 -1.49912602e+01 2.70533560e+00 1.43401113e+02
1716.lowfreq: -9.3466 -7.1750 -0.0004 0.0006 0.0009 4.8850 28.2580 35.4646 53.6043
frequency: 28.0583 35.2890 53.5741 62.0712 91.5116 104.3043 119.4905 146.4651 158.8558 162.1492 196.9304 206.9656 211.1959 213.5413 220.2371 236.5598 239.4089 260.5479 275.8490 302.4849 320.8260 330.5034 336.3564 349.0152 364.2578 397.5001 417.0566 427.3424 444.2047 466.2091 520.0755 533.7330 557.9830 563.8584 597.2465 682.8775 735.4117 754.1124 764.1667 768.6226 789.0883 805.0169 828.4751 878.6438 886.7004 908.1611 915.3879 916.0636 919.3059 936.1802 948.1114 954.4182 960.0206 988.6321 990.7757 1019.0354 1024.7856 1033.3030 1062.2814 1074.1475 1114.0557 1116.9596 1139.1178 1160.9905 1178.9316 1186.2755 1188.1244 1215.2500 1249.6240 1251.9038 1267.8822 1280.4606 1316.9771 1339.6992 1366.1487 1368.7356 1369.5030 1373.3875 1379.9286 1388.9505 1391.2500 1395.2370 1434.1904 1442.8195 1453.0274 1461.5635 1464.1856 1466.1731 1466.5596 1468.1514 1469.9013 1471.7812 1475.3253 1475.7078 1480.8008 1488.7524 1492.3908 1498.8705 1578.3581 1610.0749 2970.0492 2973.5039 2986.0168 2988.0663 2992.5228 2993.9695 3001.3798 3056.4990 3062.3122 3067.8446 3078.1405 3079.9696 3085.0215 3090.1080 3093.8942 3094.3509 3095.5723 3096.3860 3101.3208 3104.8457 3106.5473 3119.5361 3120.1942 3133.8025 3152.4389 3172.9040
redmass: 3.2246 3.3481 3.5460 2.7862 3.3720 3.1364 2.6600 1.1651 2.1277 1.1899 2.2087 1.7912 1.1015 1.8587 1.7403 1.4372 1.1248 2.6747 2.6564 1.1931 2.4080 2.7213 2.9597 2.6804 3.0959 2.7635 2.7188 2.8529 3.0371 3.1473 3.7971 3.4158 2.8463 3.3581 4.0194 3.9869 4.1883 4.4460 1.5314 2.6237 5.1495 5.2886 3.5957 1.4483 2.4926 1.6117 1.4556 1.5545 1.3324 2.3113 1.2051 1.4522 1.3612 1.3223 1.3034 1.4168 1.4618 2.1958 2.7827 1.8464 1.8057 2.7789 2.0992 2.0473 1.3414 1.8733 2.2002 1.7999 2.9953 3.1393 3.1475 1.7717 1.4274 1.8959 1.2329 1.2381 1.2487 1.2161 1.8208 1.2336 1.2130 1.2855 2.0633 1.0494 1.0856 1.0518 1.0520 1.0580 1.0518 1.0613 1.0739 1.0564 1.3477 1.1411 1.1201 1.2033 1.0793 1.0535 6.1317 5.9166 1.0348 1.0352 1.0353 1.0348 1.0356 1.0357 1.0362 1.0933 1.0998 1.0998 1.0988 1.0999 1.0996 1.0993 1.0991 1.0915 1.1001 1.0983 1.0998 1.0991 1.0991 1.0989 1.0847 1.0898 1.0963 1.0951
irintensity: 0.4491 0.1858 0.9833 0.2667 0.5227 0.9950 0.7922 0.3789 0.6270 1.2483 1.0591 0.9044 0.1812 0.4270 0.0310 0.1526 0.0409 0.0890 0.8622 0.3284 1.8622 1.5030 0.7903 1.7185 0.4615 1.2608 1.6998 1.3364 3.3196 0.0157 9.9600 11.5943 1.5389 0.1462 2.3348 4.5511 11.5809 1.0177 62.4545 15.9421 2.5431 11.1163 7.7866 0.4848 2.7896 0.4022 0.8881 1.4265 1.4608 11.9286 0.2012 0.5676 0.2985 0.0815 1.0531 0.1795 1.4975 22.0160 22.5825 2.1103 21.5993 5.9822 69.6911 7.2935 4.6393 39.0064 72.5852 4.8450 28.5111 40.8805 12.2367 3.0189 8.0677 2.3732 21.4322 15.7714 42.9297 17.8996 10.4941 29.1349 21.6353 9.1713 9.6870 0.4651 2.4479 2.6450 4.1669 7.3989 3.2992 6.9078 3.2677 6.1906 1.7026 13.8438 7.5133 39.5321 9.8274 10.0896 2.5190 2.7565 36.0770 35.0403 21.4547 16.9660 29.4008 17.1220 19.1018 34.9483 0.1020 36.7952 42.6343 10.8114 23.0850 11.1614 59.8357 26.0719 22.6386 36.1667 19.6777 30.5130 26.0499 22.9334 2.4651 18.4983 36.0178 20.3888
temp: 298.150 k
press: 1.00000 atm
elementType: 8 8 6 6 6 6 6 6 6 6 6 6 6 6 6 6 6 6 1 1 1 1 1 1 1 1 1 1 1 1 1 1 1 1 1 1 1 1 1 1 1 1 1 1
symmnumber: 1
zpe: 999184.5 jmol-1
zpe.correction: 0.380569 hartree
zpe.thermalcorrener: 0.401986 hartree
zpe.thermalcorrenthalpy: 0.402930 hartree
zpe.thermalcorrgfe: 0.331386 hartree
zpe.sumelectzpe: -774.259042 hartree
zpe.sumelectthermal: -774.237626 hartree
zpe.sumelectthermalent: -774.236682 hartree
zpe.sumelectthermalfe: -774.308226 hartree
dipole: -0.7730 -0.3689 -0.2168
dipole: 0.8836
quadrupole: -101.9591 -105.7337 -112.9869
quadrupole: -0.5405 0.1311 -0.3044
quadrupole: 4.9341 1.1595 -6.0936 -0.5405 0.1311 -0.3044
hfenergy: -774.6396118 hartree
pointgroup: C01 [X(C16H26O2)]
dipole: 0.29039 -0.1633316 0.0991751 debye
polarizability: 229.8540255|3.3504795|187.3569104|-12.8280454|-3.044146|142.7705721 unknown
InChI: InChI=1S/C16H26O2/c1-12(2)13-10-8-9-11-14(13)16(6,7)18-17-15(3,4)5/h8-12H,1-7H3
charge 0 multiplicity 1
44 atoms
O  1.038776 -0.082657 0.016764
O  2.461471 -0.224242 -0.598851
C  0.125449 -0.995589 -0.757637
C  -1.258516 -0.665707 -0.140564
C  -1.785332 0.667309 -0.056743
C  -1.036813 1.944683 -0.47894
C  0.165881 -0.672315 -2.273945
C  0.59578 -2.448047 -0.529078
C  3.442027 0.061359 0.496659
C  -2.063426 -1.745111 0.316641
C  -3.093778 0.837299 0.472566
C  -0.79196 2.87106 0.743559
C  -1.78958 2.701904 -1.605694
C  -3.361392 -1.551552 0.829806
C  -3.884159 -0.243424 0.908649
C  4.775243 -0.080847 -0.272039
C  3.239973 1.498178 1.020483
C  3.316963 -0.985505 1.621818
H  -0.040445 1.663854 -0.850753
H  1.188794 -0.813771 -2.661139
H  -0.516868 -1.355376 -2.810398
H  -0.14901 0.360735 -2.485925
H  1.640882 -2.528199 -0.870258
H  -0.011003 -3.168822 -1.105173
H  0.559124 -2.716603 0.540511
H  -1.674623 -2.765303 0.265745
H  -3.502743 1.851935 0.545116
H  -0.21852 2.339229 1.52361
H  -1.740867 3.218004 1.193486
H  -0.216251 3.764697 0.437202
H  -1.954941 2.053837 -2.486328
H  -1.204724 3.58283 -1.930831
H  -2.778418 3.063343 -1.267026
H  -3.952649 -2.411418 1.163752
H  -4.889906 -0.067056 1.306556
H  4.824453 0.639145 -1.10721
H  4.88839 -1.101087 -0.678383
H  5.617218 0.118778 0.414828
H  2.246012 1.601863 1.486479
H  4.0101 1.744401 1.774454
H  3.313054 2.223467 0.191114
H  3.482929 -2.003297 1.226355
H  4.064016 -0.790941 2.413027
H  2.310087 -0.942943 2.069537
