program: Gaussian 09
title: 000172173
version: EM64L-G09RevD.01
frameworkgroup: C1[X(C17H28O2)]
method: RPBEPBE
basis: SDD
operation: Freq
keyword: #pfreq=noraman
keyword: PBEPBE/SDD
title: #p freq=noraman PBEPBE/SDD
converged: YES YES NO NO
title: Mulliken charges:
elementType: O O C C C C C C C C C C C C C C C C C H H H H H H H H H H H H H H H H H H H H H H H H H H H H
charge: -0.301014 -0.443255 -0.387523 -0.381158 -0.364223 -0.372381 -0.392224 -0.353396 -0.569684 -0.356445 0.542655 -0.696364 -0.547948 -0.455343 0.354347 -0.198689 -0.394427 -0.272537 -0.337417 0.193529 0.195995 0.191911 0.192682 0.194321 0.191205 0.190116 0.189356 0.213406 0.207586 0.187622 0.187904 0.203778 0.207443 0.194934 0.194773 0.209748 0.215299 0.209642 0.247076 0.235498 0.224540 0.248141 0.226062 0.202447 0.212093 0.205431 0.354488
chargesum: 0.00000
title: Mulliken charges with hydrogens summed into heavy atoms:
elementType: O O C C C C C C C C C C C C C C C C C
charge: -0.301014 -0.088767 0.002001 0.003435 0.021303 0.007091 0.028768 0.022129 -0.158462 0.033261 0.542655 -0.061676 -0.300872 -0.219845 0.354347 0.025851 -0.146285 0.155972 0.080107
polarizability: 2.46205449e+02 5.36318523e+00 1.95240374e+02 -1.59451935e+01 6.52030391e+00 1.41773952e+02
1716.lowfreq: -17.7246 -3.7282 -0.0013 -0.0011 0.0004 2.8863 6.0228 15.8214 29.4238
frequency: -15.4241 12.7941 29.3605 39.3887 48.3997 57.2569 62.8269 76.6355 89.7907 110.0231 119.4939 136.8440 144.5575 145.6477 158.7608 179.8294 227.3189 234.6710 248.0557 270.9612 318.8720 332.8927 356.6497 413.8425 440.4280 451.1349 465.2149 467.0801 472.2061 557.8687 594.9058 621.2475 697.5847 719.8233 724.0965 728.9553 737.1544 765.3599 794.6352 815.6019 847.6139 864.7050 879.3341 883.3322 887.8103 892.7264 942.4807 957.8809 973.1887 982.3602 990.2010 992.9349 998.0962 1014.5520 1036.6172 1049.2923 1051.4905 1068.1109 1070.0925 1079.8803 1081.8423 1089.6824 1104.8175 1120.1249 1162.8192 1172.0942 1183.8027 1189.5998 1209.1183 1213.4512 1214.2486 1244.4913 1247.8846 1254.4039 1273.7524 1281.1755 1282.5740 1286.6415 1294.6119 1296.9419 1307.1492 1313.8513 1332.7263 1335.1740 1348.6940 1354.7945 1355.9220 1360.9716 1383.7165 1387.7027 1390.6026 1435.8346 1455.9483 1459.5683 1459.7505 1459.9378 1463.9310 1464.9873 1469.5869 1475.4421 1476.6196 1481.4290 1482.9711 1486.6362 1488.5622 1602.7680 1607.1457 2948.6104 2949.6507 2950.6273 2954.2775 2960.7051 2961.1923 2967.1358 2968.2261 2971.5339 2973.3420 2977.4173 2982.4530 2987.1914 2995.4484 3006.9525 3017.0259 3027.1397 3031.6788 3038.5222 3048.6561 3068.0129 3070.2539 3081.1460 3124.6982 3140.6346 3145.5610 3167.9015 3551.6175
redmass: 1.8103 4.0432 4.0114 3.0682 4.7178 4.1015 1.8588 3.9037 2.3332 1.8415 3.3801 2.6771 2.1518 2.5194 3.2596 4.5909 1.1304 5.0726 3.3644 2.1577 3.5889 3.2139 3.1546 2.2343 3.0527 1.3764 3.0964 3.3049 2.9524 4.3990 4.5247 4.7872 2.1743 1.0607 1.0744 3.4809 1.1114 1.1609 1.4829 1.2369 2.2416 2.0985 1.2966 2.0747 1.8961 1.4150 1.6840 1.7386 1.3359 4.7799 4.2012 4.0189 3.0113 1.1746 3.4291 2.9779 3.0880 2.2954 1.6762 2.2060 2.2464 1.7259 1.3033 2.6768 1.7881 1.1560 1.8192 1.1864 1.2685 1.2948 1.3876 1.4643 1.3398 2.4069 1.2116 1.0481 1.3799 1.0902 1.1211 1.1056 1.2550 1.3839 1.2023 1.4256 1.5456 1.6675 1.6144 1.3969 1.4040 1.2175 4.3760 2.7968 1.1402 1.0871 1.0738 1.0738 1.0666 1.0787 1.0854 1.0861 1.0431 1.1039 2.3282 1.0913 1.0981 6.7552 6.2070 1.0586 1.0587 1.0591 1.0593 1.0589 1.0554 1.0588 1.0587 1.0365 1.0687 1.0600 1.0963 1.0979 1.1003 1.1021 1.1027 1.1045 1.1057 1.1047 1.1046 1.1007 1.0992 1.0969 1.0870 1.0905 1.0927 1.0978 1.0655
irintensity: 0.0263 0.1717 0.4174 0.0306 1.1725 1.7997 0.0169 0.1967 0.1359 0.2371 3.4041 2.1188 0.4384 0.1534 2.8802 1.0895 0.0006 1.4170 0.4836 3.9336 0.4886 0.7450 0.2770 48.3426 2.5943 169.2409 2.0337 1.6300 1.6914 0.7294 7.2547 0.4059 25.0059 15.1649 0.0581 8.6841 4.6116 1.0802 49.2512 1.8083 17.0550 3.7738 5.2289 30.0955 2.7760 2.5459 15.0729 17.1940 0.7139 11.9570 1.8917 7.7629 96.9388 2.7944 1.3657 45.9795 0.5321 0.7167 5.3204 0.1127 0.6584 8.7411 6.7814 16.9447 115.2599 1.8507 0.1438 12.2504 18.8057 17.5779 7.2153 26.7782 0.1008 81.5236 0.5981 0.1905 5.1749 0.4658 0.1102 0.1630 0.4311 2.2261 15.4231 1.0888 0.6413 0.3598 0.3356 7.6440 32.3174 11.1089 9.5184 47.5017 34.0948 5.6610 0.1208 0.0995 0.1134 0.0916 0.4603 1.6472 11.9617 1.1667 37.2052 0.6177 37.8297 40.1172 116.8486 1.3682 0.1852 2.7716 0.0988 43.1442 33.1971 58.5808 90.3990 37.1289 50.3166 98.0780 0.7428 0.8456 0.7003 1.3919 0.4361 0.9226 52.4686 80.8709 151.5852 97.5906 54.9869 31.1944 7.9266 23.0081 11.6951 12.3588 6.8925
temp: 298.150 k
press: 1.00000 atm
elementType: 8 8 6 6 6 6 6 6 6 6 6 6 6 6 6 6 6 6 6 1 1 1 1 1 1 1 1 1 1 1 1 1 1 1 1 1 1 1 1 1 1 1 1 1 1 1 1
symmnumber: 1
zpe: 1084085.7 jmol-1
zpe.correction: 0.412906 hartree
zpe.thermalcorrener: 0.434309 hartree
zpe.thermalcorrenthalpy: 0.435253 hartree
zpe.thermalcorrgfe: 0.358983 hartree
zpe.sumelectzpe: -813.533827 hartree
zpe.sumelectthermal: -813.512424 hartree
zpe.sumelectthermalent: -813.511480 hartree
zpe.sumelectthermalfe: -813.587750 hartree
dipole: -2.8130 -0.2637 -0.4401
dipole: 2.8594
quadrupole: -142.8699 -113.0814 -121.2995
quadrupole: -7.3474 -7.0233 -0.6983
quadrupole: -17.1196 12.6689 4.4507 -7.3474 -7.0233 -0.6983
hfenergy: -813.9467333 hartree
pointgroup: C01 [X(C17H28O2)]
dipole: 1.1048035 -0.1323519 0.1656416 debye
polarizability: 245.7388913|-6.4302304|195.6609809|-16.7368877|-5.4856801|141.8199033 unknown
InChI: InChI=1S/C17H28O2/c1-2-3-4-5-6-7-8-10-16-11-9-12-17(15-16)19-14-13-18/h9,11-12,15,18H,2-8,10,13-14H2,1H3
charge 0 multiplicity 1
47 atoms
O  -4.771089 0.92046 0.553797
O  -6.71728 2.792031 -0.394814
C  3.110554 -0.193051 0.181231
C  4.503329 -0.120914 -0.484604
C  1.997653 -0.67156 -0.778276
C  5.614552 0.367815 0.471794
C  0.608829 -0.750382 -0.107181
C  7.009174 0.433526 -0.190655
C  -0.507814 -1.216261 -1.08316
C  8.118743 0.928438 0.765181
C  -1.875053 -1.296803 -0.41915
C  9.509543 0.987467 0.097117
C  -2.666481 -0.125572 -0.281306
C  -2.360346 -2.520101 0.103239
C  -3.919731 -0.187225 0.37172
C  -3.615055 -2.571884 0.756886
C  -4.400427 -1.411784 0.89633
C  -4.344918 2.226984 0.018337
C  -5.499789 3.180761 0.319586
H  2.843648 0.807533 0.581516
H  3.158083 -0.87421 1.056482
H  4.454361 0.55448 -1.364542
H  4.773593 -1.123363 -0.877958
H  2.266628 -1.669684 -1.183575
H  1.946009 0.013394 -1.650924
H  5.660314 -0.304424 1.354317
H  5.346499 1.372527 0.861199
H  0.648671 -1.446105 0.755009
H  0.33792 0.241981 0.307136
H  6.964757 1.102499 -1.075791
H  7.280986 -0.571882 -0.575564
H  -0.541323 -0.514244 -1.94047
H  -0.229609 -2.207069 -1.49243
H  8.160862 0.261144 1.650447
H  7.84763 1.933889 1.147517
H  9.817132 -0.011466 -0.266133
H  10.283765 1.343639 0.801572
H  9.503203 1.671794 -0.772422
H  -2.292068 0.817931 -0.693276
H  -1.758858 -3.430215 -0.004663
H  -3.985411 -3.522575 1.15654
H  -5.373406 -1.43091 1.396798
H  -4.182444 2.148814 -1.075403
H  -3.408188 2.558684 0.512365
H  -5.25458 4.194915 -0.038332
H  -5.671943 3.216648 1.415654
H  -6.895726 1.840927 -0.176137
