program: Gaussian 09
title: 000171970
version: EM64L-G09RevD.01
frameworkgroup: C1[X(C11H21NO)]
method: RPBEPBE
basis: SDD
operation: Freq
keyword: #p
keyword: freq=noraman
keyword: PBEPBE/SDD
title: #p freq=noraman PBEPBE/SDD
converged: YES YES NO NO
title: Mulliken charges:
elementType: O N C C C C C C C C C C C H H H H H H H H H H H H H H H H H H H H H
charge: -0.290606 -0.428317 0.308107 -0.420754 0.320449 -0.727762 -0.718663 -0.731208 -0.789683 -0.717830 0.247141 -0.233307 -0.493294 0.258438 0.185732 0.211373 0.223726 0.206480 0.231611 0.186683 0.205783 0.207816 0.208286 0.225660 0.223453 0.233940 0.210783 0.204548 0.271170 0.209542 0.295243 0.205036 0.220107 0.250317
chargesum: 0.00000
title: Mulliken charges with hydrogens summed into heavy atoms:
elementType: O N C C C C C C C C C C C
charge: -0.290606 -0.133075 0.308107 0.023416 0.320449 -0.086183 -0.094587 -0.089446 -0.121507 -0.032570 0.247141 -0.028271 -0.022870
polarizability: 1.53224687e+02 -1.84187357e+01 1.22403007e+02 9.00350444e-01 -2.75712621e+00 1.16359902e+02
1716.lowfreq: -16.8038 -0.0011 -0.0008 -0.0006 10.8945 19.5812 41.7747 48.6374 70.4655
frequency: 41.2191 48.4382 70.3513 110.1497 150.6361 161.3569 195.3152 202.8575 224.2792 238.9765 248.2769 269.5983 285.9796 296.4475 304.0041 310.3911 329.0352 356.0380 363.7547 398.7095 406.8138 452.9160 488.7870 491.2067 536.2021 575.5563 657.6774 730.3048 783.6507 784.5647 861.6416 885.2556 894.5281 915.6402 923.4430 928.8902 934.1906 951.1080 977.0712 980.0213 990.7611 1007.6315 1024.5661 1033.4613 1051.9377 1133.3171 1148.2409 1195.5384 1210.7679 1232.9835 1247.2306 1258.0560 1308.3629 1324.3908 1349.8323 1369.5367 1371.8364 1373.1548 1395.7116 1399.7967 1401.4262 1449.7793 1454.7636 1458.9390 1461.6925 1467.8982 1469.3519 1475.3545 1482.6310 1486.7673 1488.4393 1495.4846 1500.6365 1591.1782 1647.5114 2963.4677 2967.6443 2970.1052 2975.4131 2978.4257 2984.8148 3038.4887 3055.5677 3055.6193 3063.9327 3065.5548 3066.0982 3077.3325 3078.8370 3087.6531 3089.5911 3095.6435 3106.1718 3106.9452 3215.5902 3530.0506
redmass: 2.7991 3.8177 5.1307 2.4422 3.0116 2.0844 2.1963 1.3921 1.0641 1.3878 2.2354 1.7048 1.3008 1.1245 2.4408 2.4347 2.6550 2.1250 2.8437 2.4078 1.9168 2.0570 2.2549 1.7796 1.5100 2.4209 3.2609 3.6415 3.6642 3.4142 1.9416 2.9332 2.4037 1.7386 1.6209 1.5786 1.2564 2.1216 1.3482 1.7349 1.1130 1.3245 1.3952 1.4115 1.5737 1.6371 2.2996 2.0344 2.7170 2.8615 3.0719 3.1837 1.5116 1.4438 1.3494 1.2010 1.2096 1.2032 1.2338 1.2041 1.2199 1.1124 1.1212 1.0560 1.0514 1.0817 1.1146 1.0509 1.2171 1.1536 1.0798 1.0918 1.0679 6.0354 4.7099 1.0350 1.0377 1.0521 1.0429 1.0369 1.0370 1.0986 1.0992 1.0996 1.0986 1.0995 1.0999 1.0992 1.0998 1.0728 1.0961 1.0983 1.0805 1.0991 1.1162 1.0773
irintensity: 1.5969 0.3452 13.4324 0.0783 2.3647 0.4208 0.2175 0.2597 0.1120 0.2959 1.4728 0.5518 0.5903 0.7458 3.4164 5.3228 0.2137 0.1479 3.4195 0.9922 0.6124 2.8636 13.5879 30.8666 51.9295 0.2547 1.7310 0.0126 29.1326 2.2517 4.4180 2.8291 5.5508 3.2157 1.1866 1.7022 0.3405 8.4023 2.9054 3.3749 83.1817 0.7248 1.0481 0.0880 6.1110 2.9260 8.1261 30.6239 1.9998 79.8836 53.1366 17.0883 20.7624 1.2086 17.1797 3.9164 21.2038 48.3248 25.8705 14.2019 34.2662 46.8634 27.5519 3.6946 6.5606 14.6261 30.7162 15.7934 94.9442 46.3329 2.9470 22.1888 28.3023 81.5646 11.0658 33.3243 51.0408 15.9352 26.7437 25.2338 39.3907 3.9505 30.1952 10.5478 119.2136 5.0247 38.4372 42.0641 47.5267 11.0417 43.6443 33.8636 11.7529 10.3377 8.1470 14.9743
temp: 298.150 k
press: 1.00000 atm
elementType: 8 7 6 6 6 6 6 6 6 6 6 6 6 1 1 1 1 1 1 1 1 1 1 1 1 1 1 1 1 1 1 1 1 1
symmnumber: 1
zpe: 784135.4 jmol-1
zpe.correction: 0.298661 hartree
zpe.thermalcorrener: 0.314870 hartree
zpe.thermalcorrenthalpy: 0.315814 hartree
zpe.thermalcorrgfe: 0.256461 hartree
zpe.sumelectzpe: -560.676489 hartree
zpe.sumelectthermal: -560.660280 hartree
zpe.sumelectthermalent: -560.659336 hartree
zpe.sumelectthermalfe: -560.718689 hartree
dipole: -0.8656 0.8933 -3.3147
dipole: 3.5404
quadrupole: -80.2636 -81.1518 -82.9944
quadrupole: -2.6421 -7.4274 -0.1505
quadrupole: 1.2063 0.3181 -1.5244 -2.6421 -7.4274 -0.1505
hfenergy: -560.9751506 hartree
pointgroup: C01 [X(C11H21N1O1)]
dipole: 0.3696201 -0.3991289 -1.2822839 debye
polarizability: 154.7199375|-17.1122587|121.1576785|0.2436366|2.2918227|116.1099797 unknown
InChI: InChI=1S/C11H21NO/c1-7-9(13)12-11(5,6)8-10(2,3)4/h7,12H,1,8H2,2-6H3
charge 0 multiplicity 1
34 atoms
O  -1.902319 0.196712 1.326495
N  -0.893456 -0.735956 -0.574511
C  1.977617 0.903312 -0.005564
C  1.181637 -0.19892 0.776272
C  0.334657 -1.310954 0.063156
C  2.322918 2.003401 1.041999
C  1.157488 1.566689 -1.144921
C  3.319452 0.364948 -0.578181
C  1.089162 -2.071123 -1.054238
C  -0.105559 -2.33584 1.149304
C  -1.901236 -0.041486 0.073979
C  -3.007291 0.41705 -0.835347
C  -4.061108 1.123277 -0.354592
H  0.476954 0.308207 1.462123
H  1.911512 -0.731318 1.421163
H  2.879109 1.575897 1.898109
H  1.403895 2.475317 1.436665
H  2.950928 2.794834 0.589988
H  0.187405 1.943989 -0.774567
H  0.957151 0.864538 -1.975188
H  1.720766 2.423288 -1.56305
H  3.906048 1.194043 -1.01863
H  3.932944 -0.092429 0.221727
H  3.170635 -0.391576 -1.366789
H  0.484109 -2.927007 -1.409308
H  2.04239 -2.46757 -0.666297
H  1.319264 -1.42463 -1.920642
H  0.781983 -2.831106 1.583584
H  -0.663414 -1.829193 1.953398
H  -0.756161 -3.110757 0.704467
H  -0.973157 -0.840435 -1.588299
H  -2.941301 0.165085 -1.903996
H  -4.875927 1.46544 -1.001063
H  -4.105894 1.361073 0.714955
