program: Gaussian 09
title: 000171852
version: EM64L-G09RevD.01
frameworkgroup: C1[X(C12H6Cl4O)]
method: RPBEPBE
basis: SDD
operation: Freq
keyword: #p
keyword: freq=noraman
keyword: PBEPBE/SDD
title: #p freq=noraman PBEPBE/SDD
converged: YES YES NO NO
title: Mulliken charges:
elementType: Cl Cl Cl Cl O C C C C C C C C C C C C H H H H H H
charge: 0.027002 0.042210 0.005495 0.053295 -0.434943 0.537318 0.355118 -0.386136 -0.393055 -0.512881 -0.402143 -0.044603 -0.094419 -0.106227 0.303831 -0.184460 -0.404068 0.289364 0.273623 0.259611 0.231037 0.226699 0.358330
chargesum: 0.00000
title: Mulliken charges with hydrogens summed into heavy atoms:
elementType: Cl Cl Cl Cl O C C C C C C C C C C C C
charge: 0.027002 0.042210 0.005495 0.053295 -0.076613 0.537318 0.355118 -0.386136 -0.103691 -0.239258 -0.142532 -0.044603 -0.094419 -0.106227 0.303831 0.046577 -0.177369
polarizability: 2.63646084e+02 4.41643247e+00 1.82620834e+02 -3.95988952e+00 -1.16872773e+01 8.81745990e+01
1716.lowfreq: -7.2778 -4.4619 -3.6253 -0.0021 -0.0009 0.0020 33.4265 42.8276 69.6764
frequency: 33.4204 42.8161 69.6745 77.5650 95.3302 178.3437 195.6991 202.4956 213.9622 228.2541 234.9003 252.1159 264.5918 317.7259 337.8610 350.0737 364.3708 420.8843 444.3247 504.1220 513.4807 521.8763 541.8680 579.8333 614.4104 637.2387 668.2341 697.7850 732.1566 763.4595 784.5874 794.3445 874.3775 881.7748 896.2961 911.2059 967.8022 983.6937 1020.7507 1082.4396 1100.6606 1145.3074 1174.7735 1181.7408 1219.9446 1277.1829 1294.2132 1325.9473 1346.8000 1385.6424 1399.6722 1460.5476 1482.8428 1525.1491 1571.4429 1587.9430 1626.7204 3121.1562 3149.0054 3160.9179 3173.5022 3174.1007 3585.1017
redmass: 7.8813 11.0570 7.4857 18.7712 10.0941 14.4747 21.1297 8.5349 18.4013 7.9100 5.9434 7.7708 6.4156 26.9644 24.2300 8.2775 1.1135 4.4660 3.4400 9.4320 5.2076 7.5814 5.6887 11.5678 6.3742 6.2194 8.2432 2.1711 5.4543 7.5197 1.8490 5.6834 1.4163 1.4308 1.7396 3.7135 1.3263 6.1333 5.9171 2.1937 2.1116 1.3736 1.9127 1.0947 2.0724 4.4036 1.6861 3.1847 7.6854 8.1474 3.5689 2.9460 2.9587 9.1568 8.2914 6.4621 6.2885 1.0890 1.0914 1.0923 1.0964 1.0938 1.0661
irintensity: 0.0627 0.3017 1.0283 0.3331 0.1687 0.1826 0.0784 1.0780 0.1596 0.9260 0.0446 1.0773 2.4585 0.4083 0.2922 3.5780 141.2775 10.9004 2.1246 11.9159 11.0591 5.1758 3.8977 30.8893 4.1737 0.9461 16.3335 32.3705 0.2578 65.1945 41.1022 2.3637 22.9037 9.6363 13.4222 36.5028 0.3473 4.8635 19.8970 5.9651 29.0067 208.4562 39.7925 4.1628 9.9064 20.0394 63.6348 27.5294 27.9277 2.1567 151.5550 14.6479 21.9850 32.8111 6.6914 68.6914 48.5432 12.3888 16.6404 2.1642 4.6399 2.1582 45.9274
temp: 298.150 k
press: 1.00000 atm
elementType: 17 17 17 17 8 6 6 6 6 6 6 6 6 6 6 6 6 1 1 1 1 1 1
symmnumber: 1
zpe: 375426.8 jmol-1
zpe.correction: 0.142993 hartree
zpe.thermalcorrener: 0.158577 hartree
zpe.thermalcorrenthalpy: 0.159522 hartree
zpe.thermalcorrgfe: 0.098276 hartree
zpe.sumelectzpe: -2375.139062 hartree
zpe.sumelectthermal: -2375.123477 hartree
zpe.sumelectthermalent: -2375.122533 hartree
zpe.sumelectthermalfe: -2375.183778 hartree
dipole: -4.4500 0.1426 1.0841
dipole: 4.5824
quadrupole: -102.6321 -128.2420 -126.2473
quadrupole: -0.9782 -3.1088 -2.2079
quadrupole: 16.4084 -9.2016 -7.2069 -0.9782 -3.1088 -2.2079
hfenergy: -2375.2820544 hartree
pointgroup: C01 [X(C12H6Cl4O1)]
dipole: 1.744217 0.2397426 -0.3879668 debye
dipolederiv: -0.1763744 0.2135494 0.0567073 0.226935 -0.5252942 -0.1463858 0.0827376 -0.1418862 -0.0479502 -0.2810752 -0.2960019 -0.0733081 -0.3406524 -0.4106497 -0.1049708 -0.0829829 -0.1075674 -0.0250479 -0.1890784 0.2062438 0.0750549 0.2899289 -0.5916064 -0.1944349 0.0968925 -0.193154 -0.0878402 -0.7611698 0.0762245 0.0698435 0.0622223 -0.0094928 -0.0093265 0.061705 -0.0157088 0.0023024 -0.654658 -0.2236394 -0.5625236 -0.3164492 -0.5045005 -0.1968526 -0.7815876 -0.2010252 -0.8651741 0.4476387 0.0779651 -0.0194517 0.0837921 -0.0735438 -0.0504549 -0.0528848 -0.0297222 0.0045876 0.2387508 0.0499816 0.0578029 -0.0527351 -0.0298845 0.0889493 -0.0596953 0.0347339 0.186097 -0.0073026 -0.3842239 -0.0885006 -0.4715459 0.6457374 0.185955 -0.1167731 0.1942903 -0.0147258 -0.2540229 0.0682188 0.0284388 0.1205923 -0.1913447 -0.0548165 0.0274246 -0.0424148 -0.1126989 -0.3199615 -0.1103016 -0.2996388 0.087923 -0.1485342 -0.0120945 0.0390897 0.0156768 -0.0927066 -0.3080104 0.0316836 0.1221192 -0.037535 -0.1256422 0.0452655 0.0229862 0.007541 -0.1148715 0.1942376 0.4976094 0.1323223 0.6173204 0.4917597 0.1277338 0.144123 0.1244304 0.0333978 0.0973787 -0.3306364 -0.1191641 -0.399412 0.8884224 0.3124705 -0.0810099 0.3151152 0.0758541 0.9249092 -0.1067922 -0.0874231 -0.1294587 -0.2870787 -0.0644916 -0.0934314 -0.0655333 -0.0593863 0.634932 0.2434764 0.5786214 0.3045011 0.2099914 0.2893501 0.811446 0.297877 0.7703284 0.1977611 -0.0180733 -0.0961132 0.0641951 -0.0791593 0.0766787 0.0495708 0.0857588 0.1060036 -0.0596681 0.0261752 0.0586812 -0.1100015 -0.2204868 -0.0261019 -0.3098253 -0.0423671 -0.2880302 0.0711027 -0.0457329 -0.009515 -0.0604186 0.046462 -0.021133 -0.0070707 -0.033317 0.1356934 0.093146 0.0240297 0.0653934 0.0197198 0.1346006 -0.0518028 0.0788582 -0.0389459 0.0193291 0.0532481 -0.0307333 -0.0791472 -0.0226959 0.1191537 -0.0629727 -0.089095 -0.0436075 0.0253518 0.0204962 0.0165435 0.0727458 0.0288161 0.126599 -0.0701879 0.0881469 -0.0657904 -0.0442164 -0.1426789 -0.021027 -0.0058595 -0.033503 0.1609353 -0.0333373 -0.0293217 -0.0320816 0.0928735 0.1803993 0.0354607 0.122914 0.068461 0.3735561 -0.027039 0.2006972 -0.0223022 0.3008293 unknown
polarizability: 263.525978|-0.9690876|158.5521464|-7.5704792|42.7269466|112.3633929 unknown
InChI: InChI=1S/C12H6Cl4O/c13-9-5-8(10(14)12(16)11(9)15)6-2-1-3-7(17)4-6/h1-5,17H
charge 0 multiplicity 1
23 atoms
Cl -0.299062 -2.66633 -0.89177
Cl -3.472316 -2.39005 -0.663954
Cl -2.882792 2.911064 0.982018
Cl -4.80743 0.378789 0.283081
O  4.220164 0.994167 1.812443
C  -0.172307 0.03596 -0.136989
C  1.317151 0.015177 -0.266485
C  -1.0173 -1.070113 -0.425684
C  -0.791081 1.235026 0.301044
C  2.106484 0.486929 0.809817
C  1.951995 -0.406696 -1.466214
C  -2.424754 -0.971456 -0.299006
C  -2.184923 1.336614 0.431858
C  -3.021775 0.240808 0.128157
C  3.513327 0.524876 0.69277
C  3.356748 -0.356856 -1.57288
C  4.150314 0.104775 -0.498863
H  -0.167078 2.106538 0.515192
H  1.651139 0.800917 1.75419
H  1.351587 -0.756184 -2.310419
H  3.841627 -0.675633 -2.501554
H  5.243635 0.135274 -0.589839
H  5.195749 0.978804 1.64939
