program: Gaussian 09
title: 000172189
version: EM64L-G09RevD.01
frameworkgroup: C1[X(C21H25N2O2S2)]
method: RPBEPBE
basis: SDD
operation: Freq
keyword: #p
keyword: freq=noraman
keyword: PBEPBE/SDD
title: #p freq=noraman PBEPBE/SDD
converged: YES YES NO NO
title: Mulliken charges:
elementType: S S O O N N C C C C C C C C C C C C C C C C C C C C C H H H H H H H H H H H H H H H H H H H H H H H H H
charge: 0.365154 0.260199 -0.167689 -0.245291 -0.188014 -0.214117 -0.288015 0.197819 -0.544748 -0.574494 -0.249783 -0.670390 0.383286 -0.165300 0.196851 0.423984 -0.327678 -0.421693 -0.292154 -0.297578 -0.323035 -0.546674 -0.657651 0.339208 -0.381179 -0.253315 -0.673800 0.279123 0.268598 0.274202 0.287254 0.268898 0.261613 0.245056 0.246778 0.256429 0.241298 0.253057 0.255693 0.242338 0.267984 0.250978 0.276226 0.237751 0.245557 0.246458 0.269770 0.220301 0.219918 0.222625 0.239028 0.239162
chargesum: 1.00000
title: Mulliken charges with hydrogens summed into heavy atoms:
elementType: S S O O N N C C C C C C C C C C C C C C C C C C C C C
charge: 0.365154 0.260199 -0.167689 -0.245291 -0.188014 -0.214117 0.259706 0.197819 0.285606 -0.574494 -0.249783 0.083058 0.383286 0.091129 0.196851 0.423984 -0.086380 0.087056 -0.049816 -0.029594 -0.072057 -0.270448 0.072115 0.339208 -0.111409 0.186905 0.027016
polarizability: 8.22330305e+02 -8.76258663e+00 2.74103468e+02 -1.10751210e+01 8.16357896e+00 1.53707317e+02
1716.lowfreq: -11.3727 -2.4632 -0.0022 -0.0015 -0.0013 1.2877 13.8673 18.1379 31.6154
frequency: 13.3907 18.0649 31.5982 39.3409 52.4935 64.4665 82.1983 91.7112 103.9447 104.3516 112.4935 130.6401 136.1748 162.6617 180.2068 182.0367 193.3977 198.9717 205.6621 232.2203 238.6770 242.6589 257.0878 262.3273 275.3510 290.3132 305.9609 314.2190 328.5452 357.6845 379.0920 397.9712 400.7530 412.5224 424.1030 446.3192 476.3172 484.7028 502.2379 514.7535 525.4465 535.3379 562.8528 572.9638 587.7125 601.8294 638.6347 667.6864 679.0904 701.3616 721.2114 738.7627 757.4074 784.1168 795.5439 798.0864 805.8375 816.0478 824.4619 828.3687 838.0786 846.5036 892.0780 895.9867 912.5080 933.4539 940.9897 954.8727 967.9393 974.4945 989.8332 1013.1181 1024.2254 1060.6699 1086.3427 1095.7241 1105.4561 1109.3643 1117.0754 1128.5311 1132.8738 1143.8798 1166.8222 1171.6417 1184.3613 1186.8845 1197.3426 1239.4995 1260.4643 1265.3311 1271.3191 1277.8348 1294.9312 1298.2114 1300.5563 1341.6216 1350.6188 1358.5206 1361.0904 1363.5010 1393.6654 1403.6232 1406.3554 1410.5660 1417.2210 1430.2497 1440.0281 1448.9018 1462.3063 1465.3927 1468.4956 1469.5836 1473.1504 1477.1297 1478.6199 1483.1626 1487.2982 1491.1224 1509.4160 1528.5558 1559.9154 1594.0380 1614.0134 1631.6183 1697.1244 2969.6216 2999.3046 3004.2974 3004.5133 3020.6690 3031.1959 3034.1938 3051.8958 3087.1177 3094.7383 3100.8317 3101.1228 3101.7203 3110.1800 3115.3260 3117.1513 3119.8681 3144.3717 3146.0486 3150.8095 3155.9888 3165.1109 3167.5201 3187.6168 3199.7541
redmass: 4.8755 4.5908 6.1641 4.5709 5.0074 5.2211 3.7921 4.1678 2.6203 2.2066 3.1493 5.0376 5.6101 4.2944 4.2369 3.1041 2.0104 1.3511 1.6864 5.3901 1.0478 1.2711 3.0120 2.1449 2.8316 3.4138 4.9508 3.7128 3.9607 3.6500 8.1288 4.2345 4.1235 3.2960 4.4795 3.6742 4.4512 7.2044 6.1672 4.0295 5.1312 5.1936 6.2310 4.3039 3.4273 5.8139 3.1968 5.5960 4.3427 4.4972 5.3697 6.7636 3.5502 4.8268 1.2575 3.7088 1.4717 1.2136 1.3976 1.1455 1.8356 3.4828 3.5380 1.6364 3.9264 1.2380 1.3718 2.4712 2.6921 5.8866 1.3586 2.1344 2.5761 4.2093 1.9648 1.9264 1.4830 5.8220 2.2206 1.9809 1.4305 3.5864 1.9084 1.7192 1.6719 1.5277 1.7005 1.8573 1.7676 1.1421 2.0127 1.9351 1.4153 1.1496 1.5739 1.5250 1.8006 1.2807 2.8954 1.4093 2.6664 1.2064 1.3294 1.2024 1.1918 5.0107 3.4280 1.1251 1.0388 1.0616 1.0495 1.0459 1.1288 1.0420 1.0488 1.2861 1.0694 1.9035 3.1765 1.1404 6.0331 4.8392 6.6281 6.5558 11.5803 1.0553 1.0365 1.0366 1.0369 1.0309 1.0586 1.1085 1.0626 1.1008 1.1044 1.0991 1.0983 1.0989 1.1031 1.1019 1.1051 1.0900 1.1053 1.1057 1.0875 1.0914 1.0926 1.0880 1.0955 1.0947
irintensity: 0.4082 0.7667 0.3076 0.5290 3.3942 0.1480 1.4845 0.0832 0.4689 1.4649 1.2942 2.0498 1.4610 2.1311 2.9647 1.5885 0.8982 0.9603 3.4309 2.7535 0.0899 1.3699 5.0637 1.2482 4.9550 7.8992 0.9563 0.2439 5.3882 4.4906 27.2055 7.6470 4.4149 2.5890 6.1486 39.3544 18.6633 19.8596 8.9893 9.6756 2.1347 1.6155 21.2606 9.2011 2.9051 16.0197 81.6120 3.1015 11.0400 8.8662 6.0844 4.7370 2.4092 2.4328 3.5576 12.8644 52.6628 1.1953 3.9424 0.5362 33.8330 37.4203 32.6764 45.3363 10.8284 41.3431 0.7151 5.3417 23.7264 23.3975 2.4055 43.9461 160.4830 8.7119 9.5897 34.1647 7.3808 319.5316 7.0303 6.9237 5.8328 119.3075 303.7266 30.6875 15.9798 11.7854 27.9272 41.8865 2.8356 0.7613 288.5427 781.5400 12.8532 3.8674 34.5085 136.6162 81.6714 3.3759 6.0427 2.9149 16.6647 24.0245 19.5020 27.8586 34.1479 44.2117 4.5504 37.2281 14.8296 105.0664 8.7251 19.8849 58.0005 20.9035 8.0089 26.6471 7.9474 3.1651 92.0663 76.8285 908.7859 1406.8949 25.8832 221.0032 645.4762 38.6230 8.7369 20.8893 3.8465 4.2484 10.7789 26.3780 21.0773 3.0126 3.2757 19.3961 18.0774 21.0268 12.6015 26.5339 6.9909 0.0110 6.0903 0.7866 9.0362 1.2147 2.9372 3.8714 5.8048 1.4305
temp: 298.150 k
press: 1.00000 atm
elementType: 16 16 8 8 7 7 6 6 6 6 6 6 6 6 6 6 6 6 6 6 6 6 6 6 6 6 6 1 1 1 1 1 1 1 1 1 1 1 1 1 1 1 1 1 1 1 1 1 1 1 1 1
symmnumber: 1
zpe: 1096182.8 jmol-1
zpe.correction: 0.417514 hartree
zpe.thermalcorrener: 0.445284 hartree
zpe.thermalcorrenthalpy: 0.446228 hartree
zpe.thermalcorrgfe: 0.357504 hartree
zpe.sumelectzpe: -1869.076750 hartree
zpe.sumelectthermal: -1869.048980 hartree
zpe.sumelectthermalent: -1869.048036 hartree
zpe.sumelectthermalfe: -1869.136760 hartree
dipole: -0.3461 1.4408 0.4633
dipole: 1.5525
quadrupole: -14.5442 -158.4713 -168.2250
quadrupole: -23.8693 -2.2310 3.8557
quadrupole: 99.2026 -44.7245 -54.4781 -23.8693 -2.2310 3.8557
hfenergy: -1869.4942643 hartree
pointgroup: C01 [X(C21H25N2O2S2)]
dipole: 0.156767 0.5580958 -0.1924636 debye
polarizability: 821.2903308|-15.4688825|274.1744696|-25.1898269|-8.8352264|154.6762891 unknown
InChI: InChI=1S/C21H25N2O2S2/c1-5-22-16(9-8-15-14-17(25-7-3)11-12-18(15)22)10-13-19-20(24)23(4,6-2)21(26)27-19/h8-14H,5-7H2,1-4H3
charge 1 multiplicity 1
52 atoms
S  -3.900953 1.552591 0.208322
S  -6.894958 2.247276 0.397691
O  -4.465051 -2.383548 0.258347
O  6.913696 -0.959327 -0.068512
N  -5.830922 -0.346183 0.366006
N  1.514124 0.735425 -0.307544
C  -6.732416 -0.82951 -0.798894
C  -4.406976 -1.133031 0.255091
C  -6.452795 -0.75095 1.703201
C  -5.637058 1.157154 0.325705
C  -3.346632 -0.19959 0.186635
C  -6.167878 -0.477851 -2.176271
C  0.485368 -0.162652 -0.020747
C  -1.98586 -0.576664 0.104308
C  2.881999 0.364218 -0.238354
C  3.23072 -1.010447 0.027746
C  -0.885956 0.279951 0.019194
C  1.180874 2.138795 -0.714228
C  0.849163 -1.533103 0.24626
C  2.164283 -1.949659 0.255896
C  3.935071 1.301662 -0.425563
C  4.589518 -1.405862 0.074059
C  1.10374 3.112911 0.47824
C  5.620375 -0.468834 -0.13013
C  5.277012 0.897119 -0.374083
C  8.052904 -0.020359 -0.2689
C  9.327334 -0.847446 -0.151574
H  -6.802639 -1.921481 -0.656148
H  -7.716694 -0.361339 -0.626129
H  -7.459006 -0.310447 1.769101
H  -6.490632 -1.850845 1.726718
H  -5.819825 -0.374464 2.521034
H  -6.862751 -0.864989 -2.941418
H  -6.082679 0.611576 -2.326964
H  -5.185808 -0.947598 -2.354414
H  -1.843568 -1.66539 0.095507
H  -1.08671 1.355034 0.006235
H  1.939752 2.465146 -1.441765
H  0.229457 2.110953 -1.26838
H  0.053553 -2.245163 0.468312
H  2.411286 -2.996136 0.461953
H  3.732931 2.36085 -0.595488
H  4.852994 -2.449078 0.272919
H  0.327094 2.811856 1.202138
H  2.063451 3.168029 1.019764
H  0.85801 4.125738 0.113981
H  6.057127 1.64924 -0.518052
H  7.960865 0.445789 -1.270224
H  8.006875 0.768517 0.508233
H  10.208762 -0.197575 -0.296627
H  9.401773 -1.31643 0.843604
H  9.35216 -1.641578 -0.916193
