program: Gaussian 09
title: 000171819
version: EM64L-G09RevD.01
frameworkgroup: C1[X(C10H14N2O4)]
method: RPBEPBE
basis: SDD
operation: Freq
keyword: #p
keyword: freq=noraman
keyword: PBEPBE/SDD
title: #p freq=noraman PBEPBE/SDD
converged: NO YES NO NO
title: Mulliken charges:
elementType: O O O O N N C C C C C C C C C C H H H H H H H H H H H H H H
charge: -0.280245 -0.215927 -0.343523 -0.182254 -0.144105 -0.402306 0.103821 -0.080291 -0.550649 0.242753 0.175356 -0.727871 -0.707286 -0.050147 0.189704 -0.584361 0.225834 0.251854 0.227626 0.226862 0.221002 0.265364 0.223462 0.222479 0.243668 0.369448 0.247918 0.218371 0.229351 0.384093
chargesum: 0.00000
title: Mulliken charges with hydrogens summed into heavy atoms:
elementType: O O O O N N C C C C C C C C C C
charge: -0.280245 -0.215927 0.040569 -0.182254 -0.144105 -0.032858 0.103821 0.145543 -0.071170 0.242753 0.175356 -0.014643 -0.017676 0.197771 0.189704 -0.136639
polarizability: 1.53083555e+02 -1.65679638e+00 1.25769897e+02 2.33511828e+00 -8.95426108e+00 1.25105652e+02
1716.lowfreq: -13.5077 -7.0734 0.0007 0.0007 0.0007 6.4522 42.0736 47.7583 73.9393
frequency: 41.5046 47.4231 73.9269 76.4617 95.7284 150.4563 161.4012 169.3995 194.8775 204.4799 238.8732 252.0774 267.5460 302.3355 313.4764 338.4177 348.7588 359.9808 400.8493 413.1675 432.8774 450.1863 467.1995 518.7606 569.3658 628.3053 634.6444 662.7810 679.8051 686.6352 721.7462 756.7509 835.0313 861.4244 905.3311 913.2241 927.2515 955.3993 959.4501 977.2031 1000.3592 1021.7715 1060.6151 1091.8260 1122.7486 1143.8750 1161.4867 1173.7646 1184.0808 1260.9727 1283.5282 1296.2285 1305.1794 1312.5815 1321.5571 1327.7038 1377.3792 1388.1337 1405.4826 1424.9231 1439.4756 1449.2996 1466.2614 1471.6869 1484.4310 1490.5813 1559.2846 1637.4316 1657.6573 1681.8412 2969.0036 2989.3936 2993.1050 3017.6954 3077.5913 3084.3136 3087.5589 3092.4301 3097.5136 3100.7154 3112.7979 3200.1432 3242.4821 3514.9353
redmass: 3.6420 3.3618 4.2223 3.5933 5.2815 5.3297 3.4582 3.9958 4.4794 1.2749 1.0860 3.8913 4.6306 3.3736 5.8819 3.5744 8.4654 5.6826 2.6254 2.2780 3.4191 3.3268 1.2735 3.6336 3.5257 2.5891 2.9000 4.7599 8.7671 4.5140 3.7238 1.8085 2.3308 4.2976 2.6051 2.2454 1.2284 1.4197 1.3399 3.0977 1.9148 1.1908 2.2842 4.0101 2.2338 3.1513 3.4129 2.0747 3.8325 1.4692 1.3094 1.9757 1.6910 1.6331 1.3450 3.8114 1.6456 1.1882 1.1918 1.1568 1.7064 1.1112 1.0561 1.0538 1.0478 1.0534 6.8391 7.2682 4.6254 7.4978 1.0840 1.0359 1.0364 1.0607 1.0997 1.0988 1.0755 1.0819 1.0999 1.0998 1.0958 1.1149 1.0641 1.0768
irintensity: 0.0523 0.0074 0.1981 0.4071 0.5421 5.9737 1.8795 0.9341 0.0751 0.2069 0.0292 0.1846 0.9928 3.9030 5.5400 3.9300 30.4928 11.6456 1.1369 4.1168 4.0129 19.1327 97.3786 21.2268 7.4576 14.5542 13.9639 20.3900 8.7979 27.8247 19.1248 101.1473 10.4906 7.3563 6.7453 4.6531 2.7116 1.0027 76.8333 11.2195 3.1149 27.7519 23.2240 108.4600 4.0934 30.6702 29.4490 7.6707 66.1774 40.8791 12.6763 132.6504 32.8014 51.6081 10.0241 81.4591 8.0881 27.2875 30.9786 11.4427 273.2282 16.9905 7.2429 16.5665 6.8024 12.7775 212.3305 208.7709 11.4914 402.8687 15.3782 14.4841 24.9349 15.1325 3.9124 47.8031 1.1982 8.7934 15.8385 22.8971 8.3950 20.7680 38.1399 69.9581
temp: 298.150 k
press: 1.00000 atm
elementType: 8 8 8 8 7 7 6 6 6 6 6 6 6 6 6 6 1 1 1 1 1 1 1 1 1 1 1 1 1 1
symmnumber: 1
zpe: 613542.8 jmol-1
zpe.correction: 0.233686 hartree
zpe.thermalcorrener: 0.250303 hartree
zpe.thermalcorrenthalpy: 0.251247 hartree
zpe.thermalcorrgfe: 0.189923 hartree
zpe.sumelectzpe: -798.603787 hartree
zpe.sumelectthermal: -798.587171 hartree
zpe.sumelectthermalent: -798.586226 hartree
zpe.sumelectthermalfe: -798.647551 hartree
dipole: 2.6125 1.7434 0.1217
dipole: 3.1432
quadrupole: -111.7640 -89.7928 -96.6239
quadrupole: 1.7914 1.3277 3.1602
quadrupole: -12.3704 9.6008 2.7696 1.7914 1.3277 3.1602
hfenergy: -798.8374734 hartree
pointgroup: C01 [X(C10H14N2O4)]
dipole: 0.94771 -0.7191018 -0.3376387 debye
polarizability: 152.5624185|-0.1496694|130.4955324|-5.3984665|-7.1071456|120.9011529 unknown
InChI: InChI=1S/C10H14N2O4/c1-4-5-10(6(2)3)7(13)11-9(15)12(16)8(10)14/h4,6,11,16H,1,5H2,2-3H3
charge 0 multiplicity 1
30 atoms
O  -0.319898 -1.100654 1.998879
O  1.216682 1.589055 -1.686008
O  -2.798382 -0.385084 1.490706
O  -3.302348 1.234919 -0.674386
N  -1.751178 -0.035084 0.574718
N  -1.023876 1.294083 -1.215199
C  0.636944 -0.241751 -0.131024
C  0.649963 -1.531186 -1.109921
C  2.009254 -0.03382 0.583189
C  -0.460811 -0.474042 0.902237
C  0.335696 0.965703 -1.041611
C  1.846899 -1.493132 -2.089636
C  0.633026 -2.872932 -0.339463
C  1.98078 1.049863 1.645915
C  -2.134716 0.853635 -0.460033
C  2.589849 2.255425 1.521687
H  -0.286393 -1.469374 -1.703931
H  2.747505 0.227535 -0.192351
H  2.304599 -0.994304 1.043385
H  2.795165 -1.713994 -1.568108
H  1.703489 -2.272698 -2.859883
H  1.951029 -0.520838 -2.598952
H  1.495934 -2.963313 0.343715
H  0.695435 -3.6998 -1.070079
H  -0.283481 -3.01736 0.256011
H  -1.237408 2.015364 -1.912713
H  1.434435 0.807396 2.568657
H  2.548579 3.001986 2.323112
H  3.140092 2.529722 0.613277
H  -2.270465 -0.874519 2.204612
