program: Gaussian 09
title: 000171798
version: EM64L-G09RevD.01
frameworkgroup: C1[X(C10H13N5O4)]
method: RPBEPBE
basis: SDD
operation: Freq
keyword: #p
keyword: freq=noraman
keyword: PBEPBE/SDD
title: #p freq=noraman PBEPBE/SDD
converged: YES YES NO NO
title: Mulliken charges:
elementType: O O O O N N N N N C C C C C C C C C C H H H H H H H H H H H H H
charge: -0.294562 -0.423809 -0.484741 -0.433056 -0.166471 -0.084480 -0.044412 -0.062678 -0.610185 -0.168217 -0.046483 -0.180915 -0.083403 -0.317762 0.170712 -0.207399 -0.103712 0.167852 -0.362556 0.266275 0.283703 0.240421 0.254239 0.182989 0.218184 0.374121 0.366055 0.266095 0.363330 0.243849 0.343730 0.333288
chargesum: 0.00000
title: Mulliken charges with hydrogens summed into heavy atoms:
elementType: O O O O N N N N N C C C C C C C C C C
charge: -0.294562 -0.049688 -0.118686 -0.069725 -0.166471 -0.084480 -0.044412 -0.062678 0.066833 0.098058 0.237220 0.059506 0.170836 0.083411 0.170712 0.058695 -0.103712 0.167852 -0.118707
polarizability: 2.17509247e+02 8.84559521e-01 1.40695421e+02 -2.29714823e+00 2.36731406e+01 1.08493708e+02
1716.lowfreq: -12.0944 -8.2267 -0.0005 -0.0002 0.0003 5.2874 23.4460 26.9726 53.6338
frequency: 23.3312 26.9382 53.6199 60.7085 99.6832 116.6368 143.6867 164.4530 199.7210 208.1194 234.1649 256.3549 268.0786 275.0472 307.5935 326.5359 356.7903 404.4406 483.7437 495.6948 509.3379 513.4694 517.8224 539.0237 545.8299 562.9208 568.3683 601.8802 634.3287 647.7356 669.1830 694.0694 704.7151 791.1277 805.2159 821.0971 825.2566 851.7766 870.6809 926.7624 930.3890 957.9789 962.0751 971.7420 1006.1247 1027.0630 1042.7500 1060.1349 1065.5156 1088.3099 1128.9556 1153.3760 1180.8199 1189.5787 1216.6599 1228.5602 1243.6995 1251.6451 1265.7486 1273.0241 1293.8994 1306.8132 1315.4165 1328.6645 1335.3990 1355.0008 1359.4565 1373.0455 1385.6471 1388.3820 1403.3440 1433.2704 1460.9458 1466.0393 1546.8807 1579.2771 1633.1006 2933.3282 3008.9497 3022.9339 3027.1675 3059.7156 3065.0747 3167.7138 3234.6118 3493.4891 3527.8077 3540.9316 3610.8417 3696.1944
redmass: 6.3449 6.7884 5.1005 6.1951 3.1802 5.2778 6.6787 5.2628 6.3248 1.1919 5.2472 4.3919 5.1878 3.9243 4.3922 5.3220 5.8679 4.0968 1.1862 1.2003 8.4325 1.2579 2.5557 4.8206 1.0607 3.9943 4.7284 5.3731 6.4506 4.6746 8.1371 5.2301 6.1700 3.2121 3.9841 2.2153 4.5425 7.6217 3.2429 4.9235 1.5035 2.7450 2.7380 2.8025 3.6977 3.0555 2.4286 4.4149 2.7958 2.9073 3.5714 1.3651 1.1971 2.1857 1.4360 2.0143 1.3872 1.2655 1.6990 1.5970 2.0178 2.6526 3.8290 2.2793 1.2661 1.5347 1.7148 1.3083 2.9711 1.3702 1.5482 3.0902 1.1191 3.8541 7.8996 1.8726 2.7821 1.0693 1.0868 1.0855 1.0865 1.0867 1.0940 1.0921 1.0982 1.0645 1.0653 1.0442 1.0671 1.1056
irintensity: 0.5125 0.0396 4.6308 5.1417 7.9901 2.3608 0.8395 0.2738 1.3311 155.2048 2.3633 14.3819 12.5334 5.3213 9.2396 3.7679 2.5837 0.1947 159.0624 136.4181 1.7057 249.2102 18.8037 9.3304 0.1581 0.4028 13.1665 23.0975 10.0464 39.6152 4.1512 52.2255 1.5469 20.6051 19.5304 5.3918 28.7888 1.8563 41.2463 199.8418 31.8130 29.5311 26.5528 44.7780 106.7221 16.0393 33.2415 102.7598 5.2113 25.9164 9.9978 37.9801 22.7276 29.9232 21.7220 80.7323 7.7791 7.8692 39.2923 72.9680 51.7978 8.5817 43.4841 13.7673 7.5789 29.5734 42.0240 53.0135 39.1120 27.2635 4.3636 101.2945 3.2800 50.2470 75.3273 36.2797 607.8522 61.2589 34.0176 25.0754 7.5039 18.5134 51.4289 16.9318 0.0924 42.9736 14.9102 125.3286 22.3477 49.5559
temp: 298.150 k
press: 1.00000 atm
elementType: 8 8 8 8 7 7 7 7 7 6 6 6 6 6 6 6 6 6 6 1 1 1 1 1 1 1 1 1 1 1 1 1
symmnumber: 1
zpe: 638228.3 jmol-1
zpe.correction: 0.243088 hartree
zpe.thermalcorrener: 0.260286 hartree
zpe.thermalcorrenthalpy: 0.261230 hartree
zpe.thermalcorrgfe: 0.196729 hartree
zpe.sumelectzpe: -962.074167 hartree
zpe.sumelectthermal: -962.056969 hartree
zpe.sumelectthermalent: -962.056025 hartree
zpe.sumelectthermalfe: -962.120526 hartree
dipole: -3.5298 -0.3592 1.2889
dipole: 3.7749
quadrupole: -83.8532 -118.0033 -117.3309
quadrupole: 20.4376 1.0312 7.9119
quadrupole: 22.5426 -11.6075 -10.9351 20.4376 1.0312 7.9119
hfenergy: -962.3172551 hartree
pointgroup: C01 [X(C10H13N5O4)]
dipole: 1.3730929 0.1752411 0.5381282 debye
polarizability: 217.2056148|3.7473989|141.8229064|5.297036|-22.806751|107.6698543 unknown
InChI: InChI=1S/C10H13N5O4/c11-8-5-9(13-2-12-8)15(3-14-5)10-7(18)6(17)4(1-16)19-10/h2-4,6-7,10,16-18H,1,11H2
charge 0 multiplicity 1
32 atoms
O  1.865651 -0.493047 -0.869913
O  1.433804 2.112498 1.723435
O  3.335713 2.272766 -0.113663
O  3.684767 -2.60245 -0.951994
N  -0.255563 -0.194672 0.188806
N  -1.777345 -1.693184 1.032823
N  -1.809519 1.303312 -1.047946
N  -4.152907 0.584434 -0.82664
N  -4.804156 -1.313563 0.422558
C  1.854098 0.878071 1.110584
C  0.999779 0.455859 -0.123087
C  3.28197 0.938332 0.506049
C  3.298843 -0.206191 -0.528806
C  3.896825 -1.520494 0.002536
C  -1.51519 0.228499 -0.265819
C  -0.480672 -1.352098 0.958724
C  -2.437517 -0.705955 0.272708
C  -3.812478 -0.490125 -0.037581
C  -3.153797 1.402446 -1.280306
H  1.797383 0.10506 1.895561
H  0.759281 1.334424 -0.75113
H  4.07157 0.831462 1.275097
H  3.804224 0.090114 -1.466979
H  3.449884 -1.764496 0.992667
H  4.991482 -1.434045 0.118016
H  1.789161 2.851879 1.158701
H  4.23425 2.459979 -0.477695
H  0.331353 -1.913908 1.414097
H  2.727972 -2.576615 -1.219295
H  -3.474859 2.241693 -1.904151
H  -4.570058 -2.112341 1.008023
H  -5.769348 -1.111246 0.17072
