program: Gaussian 09
title: 000171796
version: EM64L-G09RevD.01
frameworkgroup: C1[X(C9H12NO7P)]
method: RPBEPBE
basis: SDD
operation: Freq
keyword: #p
keyword: freq=noraman
keyword: PBEPBE/SDD
title: #p freq=noraman PBEPBE/SDD
converged: YES YES NO NO
title: Mulliken charges:
elementType: P O O O O O O O N C C C C C C C C C H H H H H H H H H H H H
charge: 1.400727 -0.544712 -0.500519 -0.491697 -0.486632 -0.591673 -0.211191 -0.226718 0.019052 0.310850 0.413121 0.205401 -0.493982 -0.333119 -0.352522 -0.402878 -0.483937 -0.477263 0.330135 0.298852 0.289451 0.239822 0.239116 0.365001 0.248653 0.237353 0.254893 0.241166 0.257155 0.246094
chargesum: 0.00000
title: Mulliken charges with hydrogens summed into heavy atoms:
elementType: P O O O O O O O N C C C C C C C C C
charge: 1.400727 -0.544712 -0.500519 -0.491697 -0.121631 -0.591673 -0.211191 -0.226718 0.019052 0.310850 0.413121 0.205401 -0.163847 -0.034267 -0.063071 0.076060 0.256962 0.267153
polarizability: 2.30763172e+02 7.04051120e+00 1.69489379e+02 -8.31038774e+00 6.90383933e+00 9.57639388e+01
1716.lowfreq: -6.7250 -0.0013 0.0002 0.0008 4.3850 6.7272 14.5768 19.1984 32.7984
frequency: 13.4168 18.6720 32.6356 40.3599 60.2160 64.3897 84.5082 97.5894 127.9983 147.1320 152.0297 169.0783 178.2622 208.3656 218.7066 231.3228 252.6589 275.5624 296.9131 325.7299 337.3093 362.8763 380.7126 415.5712 442.4672 449.5155 532.3618 554.8123 578.5438 587.2521 609.9130 666.5138 684.9038 701.2835 722.6951 746.8569 784.3838 851.0037 913.5903 943.4903 959.3588 961.4471 980.5011 987.1363 1002.6420 1060.6776 1062.9763 1112.9618 1113.9236 1120.9244 1129.1896 1132.1964 1161.7920 1185.9939 1204.8634 1205.6674 1225.5610 1271.1406 1344.8245 1385.8047 1403.5345 1422.3279 1425.3633 1426.3899 1439.8764 1457.2078 1457.9753 1466.1215 1470.9978 1473.1678 1572.2773 1616.7870 2969.3261 2995.0796 3000.9384 3017.1500 3100.9749 3112.0217 3138.2225 3142.9768 3158.1729 3186.4289 3198.6109 3600.0065
redmass: 3.0072 3.6827 1.4271 11.3478 3.3874 3.6803 4.5044 4.2813 1.1589 4.7901 4.5368 8.7388 4.5697 3.1997 4.5610 6.9755 1.2211 4.2333 6.6085 10.3108 7.6248 7.7501 9.4042 7.3690 5.3766 3.9271 6.7110 4.6107 7.1432 6.0482 8.9751 4.6516 9.5893 10.6408 5.5191 6.9009 10.1315 1.3838 1.3838 4.9280 7.0942 11.7774 8.2390 1.3575 1.6940 5.0958 14.0215 1.2368 1.2355 1.5657 1.2825 1.2987 1.5112 1.4601 5.6054 1.0972 2.5725 1.5191 5.4632 2.1136 4.0773 1.6756 1.1498 1.1205 1.6766 1.0588 1.0515 2.7311 1.0531 1.0663 7.0025 7.3787 1.0566 1.0291 1.0287 1.1041 1.1060 1.1055 1.1043 1.1054 1.0920 1.0948 1.0918 1.0666
irintensity: 0.5123 1.6604 0.8155 0.7419 0.5260 4.9027 5.9466 1.6159 0.6682 0.6934 2.7929 3.7309 3.6652 21.0691 19.5663 15.2133 122.0728 43.3928 4.2336 35.3229 10.8497 16.6966 2.5193 8.1501 22.9753 19.8684 25.1922 0.0638 20.4319 2.6866 55.2339 18.3314 142.6303 148.4687 4.9986 220.4369 23.5997 40.5364 28.1575 337.5498 101.6599 174.9465 119.5572 0.9820 3.2774 54.0464 124.0158 0.7073 0.3390 93.1277 1.4608 1.5310 17.2692 35.1321 619.2552 25.9473 10.2596 50.3964 100.6353 17.7263 12.5029 52.5430 0.7592 3.9189 40.2767 11.2281 10.1375 71.2972 24.9297 6.2396 144.3032 153.3407 22.9249 46.4651 33.9363 19.0313 23.1267 21.2109 8.8235 12.8131 0.9585 2.8429 8.5156 16.2840
temp: 298.150 k
press: 1.00000 atm
elementType: 15 8 8 8 8 8 8 8 7 6 6 6 6 6 6 6 6 6 1 1 1 1 1 1 1 1 1 1 1 1
symmnumber: 1
zpe: 557000.0 jmol-1
zpe.correction: 0.212150 hartree
zpe.thermalcorrener: 0.232287 hartree
zpe.thermalcorrenthalpy: 0.233231 hartree
zpe.thermalcorrgfe: 0.159617 hartree
zpe.sumelectzpe: -1271.207279 hartree
zpe.sumelectthermal: -1271.187142 hartree
zpe.sumelectthermalent: -1271.186198 hartree
zpe.sumelectthermalfe: -1271.259811 hartree
dipole: 3.5210 4.1805 2.9881
dipole: 6.2292
quadrupole: -121.0343 -103.6726 -110.8196
quadrupole: -8.9295 11.0254 -4.8227
quadrupole: -9.1921 8.1696 1.0225 -8.9295 11.0254 -4.8227
hfenergy: -1271.4194287 hartree
pointgroup: C01 [X(C9H12N1O7P1)]
dipole: 1.3475827 -1.4322623 -1.4625133 debye
polarizability: 230.6595589|-9.1135793|165.076055|5.6824635|19.2448199|100.2808757 unknown
InChI: InChI=1S/C9H12NO7P/c1-15-18(14,16-2)17-8-3-4-9(10(12)13)7(5-8)6-11/h3-5,11H,6H2,1-2H3
charge 0 multiplicity 1
30 atoms
P  3.155068 0.310707 0.341403
O  1.715527 -0.671196 0.451443
O  3.185963 0.521669 -1.373571
O  4.306559 -0.879861 0.735085
O  -2.198278 -2.950945 -0.982007
O  3.264802 1.630551 1.206711
O  -3.894298 2.334548 0.608401
O  -4.593826 0.308526 -0.159339
N  -3.660307 1.117882 0.240324
C  -1.93477 -0.702741 -0.138705
C  0.399688 -0.163915 0.388483
C  -2.271826 0.623073 0.273826
C  -0.574618 -1.070909 -0.073013
C  0.058652 1.144864 0.810443
C  -1.287992 1.528809 0.740981
C  -2.936741 -1.727521 -0.647035
C  3.877328 1.719416 -1.923299
C  4.292459 -2.203412 0.053184
H  -0.287795 -2.074378 -0.391162
H  0.819949 1.831147 1.193866
H  -1.607047 2.526292 1.053004
H  -3.703389 -1.917682 0.130629
H  -3.471327 -1.324098 -1.530242
H  -2.836681 -3.635693 -1.298252
H  3.525341 1.783881 -2.962979
H  4.971527 1.577164 -1.89511
H  3.597169 2.626063 -1.359993
H  4.365175 -2.076978 -1.041019
H  3.375935 -2.754335 0.319163
H  5.184255 -2.713328 0.444881
