program: Gaussian 09
title: 000171786
version: EM64L-G09RevD.01
frameworkgroup: C1[X(C21H18N3O2)]
method: RPBEPBE
basis: SDD
operation: Freq
keyword: #p
keyword: freq=noraman
keyword: PBEPBE/SDD
title: #p freq=noraman PBEPBE/SDD
converged: YES YES NO NO
title: Mulliken charges:
elementType: O O N N N C C C C C C C C C C C C C C C C C C C C C H H H H H H H H H H H H H H H H H H
charge: -0.433802 -0.222820 -0.181977 -0.692405 -0.683274 0.043027 0.281263 0.330122 0.232407 0.270889 0.186166 -0.585090 -0.577389 -0.364186 -0.355579 -0.652521 0.555309 0.566679 -0.451105 -0.470685 -0.330696 -0.329386 -0.341619 -0.314961 0.240122 0.127222 0.257471 0.261743 0.238395 0.235471 0.290352 0.265787 0.265160 0.246130 0.248034 0.262779 0.261160 0.290815 0.293745 0.331038 0.333883 0.338224 0.330524 0.403575
chargesum: 1.00000
title: Mulliken charges with hydrogens summed into heavy atoms:
elementType: O O N N N C C C C C C C C C C C C C C C C C C C C C
charge: -0.030226 -0.222820 -0.181977 -0.027484 -0.014526 0.043027 0.281263 0.330122 0.232407 0.270889 0.186166 -0.327619 -0.315645 -0.125791 -0.120108 0.168778 0.555309 0.566679 -0.204975 -0.222651 -0.067917 -0.068226 -0.050804 -0.021216 0.240122 0.127222
polarizability: 4.29536639e+02 5.29064532e+01 3.23175115e+02 1.75811578e+00 -5.38633928e-02 1.47873442e+02
1716.lowfreq: -10.9414 -6.0880 -4.2881 -0.0008 -0.0006 -0.0004 5.3037 32.2243 32.4570
frequency: -8.4344 32.2044 32.4420 54.9136 69.0181 89.8296 113.2558 129.0166 147.1685 153.7671 178.1740 209.7444 230.4576 243.5848 264.1354 271.3392 314.6890 340.7701 364.0536 369.8410 388.0116 400.1308 406.2711 415.4796 422.5969 426.6556 443.6424 461.8969 468.3051 490.4186 500.9905 510.4200 520.9731 522.2828 562.6452 568.9498 595.9551 616.4143 619.0974 630.7007 632.0533 679.5433 690.3712 694.5319 695.5708 724.2211 729.7566 755.8880 775.0971 780.0840 831.0020 840.8009 844.2189 850.3333 866.9608 876.0930 880.3155 940.2024 965.6592 967.4884 978.2058 984.9434 996.0113 1005.0944 1005.7171 1020.3756 1034.0647 1053.5292 1057.2024 1109.3541 1117.1459 1119.4951 1135.5700 1148.6153 1172.3634 1193.4007 1196.8714 1243.2488 1251.1447 1282.1850 1303.9213 1324.5819 1329.3774 1345.0994 1357.1385 1360.1195 1374.0180 1384.4433 1399.6378 1405.5263 1442.4348 1450.3260 1474.1227 1478.9861 1481.6710 1484.0754 1501.0291 1509.0652 1545.9146 1557.9669 1566.3332 1571.8885 1616.2979 1639.7141 1647.2736 1649.1347 1658.3287 1660.1331 3016.1324 3105.9683 3138.0478 3143.5016 3144.9786 3145.1194 3161.2032 3168.4415 3169.4440 3171.1390 3180.1588 3182.4144 3183.4659 3532.1200 3550.9258 3554.5999 3686.0890 3690.0331
redmass: 4.8060 5.5092 6.0191 4.7521 6.3474 3.7144 3.8684 6.2098 4.5732 5.7576 4.0716 5.7801 1.6736 2.5750 3.0798 4.0827 5.4955 3.9097 3.7219 3.8055 3.2513 2.8363 6.5805 1.1072 4.1599 1.0423 2.7089 4.0376 3.7406 4.7603 3.5044 1.2446 5.9665 1.2651 4.8944 3.1986 2.4406 1.7148 5.2035 4.2745 4.6304 6.1425 4.3540 4.1794 4.7047 3.1471 4.8473 5.0083 2.3909 4.9973 1.5003 1.8059 4.7305 2.0352 1.5852 1.4504 1.7581 3.3293 1.4072 2.8917 1.3624 5.7470 1.3680 3.8245 1.3985 3.1587 2.6224 1.8006 1.5020 1.7499 1.3832 1.3483 2.5465 1.7310 1.3495 1.7316 1.1698 2.7740 1.3243 1.6251 1.3165 2.0103 2.6069 2.3029 3.8842 6.1926 2.8746 3.6561 3.2745 3.0280 1.4833 6.3215 2.9861 5.4246 1.2939 1.0430 3.0373 3.3194 5.0100 5.2048 7.6476 6.4557 6.2747 3.4100 2.9481 8.1134 1.4198 1.4516 1.0370 1.1031 1.0897 1.0900 1.0909 1.0897 1.0913 1.0965 1.0981 1.0966 1.0916 1.0923 1.0956 1.0645 1.0461 1.0461 1.1039 1.1040
irintensity: 0.5240 0.2337 0.1774 2.5541 1.2152 0.9579 1.4359 0.5058 4.6730 5.6256 0.5417 0.9094 0.1264 1.9171 3.2844 0.4199 2.1099 3.3242 0.0016 1.2248 0.6049 0.9598 18.1121 11.5018 3.2201 0.0398 14.0126 1.6626 16.9158 24.7899 25.1148 222.7440 3.3474 309.7751 11.6834 0.3739 51.9555 42.8926 1.7667 23.6350 0.8983 14.5272 46.8817 40.6320 0.4649 6.0205 10.5499 15.6514 0.2102 2.2568 44.9260 2.4606 8.2882 80.7769 9.0440 7.7423 26.9715 12.8432 0.1885 3.8890 0.3647 12.8034 1.0194 147.3779 4.1498 55.2297 136.4580 17.7073 4.4610 17.7366 4.5768 1.6288 7.9073 91.7002 17.4079 8.4920 4.1951 21.2201 26.6397 124.0670 8.0457 154.8222 42.5488 12.5538 63.3945 2.7819 60.2141 14.2451 28.1428 15.3758 6.2079 55.3275 40.3375 12.1771 14.9904 9.7551 79.8657 364.0232 19.1566 22.9426 11.7892 24.8894 7.4879 29.0266 152.5651 237.3397 772.0932 127.9670 8.5562 3.7400 7.7542 2.8162 2.5828 4.7592 7.2383 2.2140 1.4188 1.0520 12.4046 8.4343 1.3236 86.7645 317.1719 136.4216 35.2011 32.6838
temp: 298.150 k
press: 1.00000 atm
elementType: 8 8 7 7 7 6 6 6 6 6 6 6 6 6 6 6 6 6 6 6 6 6 6 6 6 6 1 1 1 1 1 1 1 1 1 1 1 1 1 1 1 1 1 1
symmnumber: 1
zpe: 910043.0 jmol-1
zpe.correction: 0.346617 hartree
zpe.thermalcorrener: 0.367745 hartree
zpe.thermalcorrenthalpy: 0.368689 hartree
zpe.thermalcorrgfe: 0.297182 hartree
zpe.sumelectzpe: -1123.792510 hartree
zpe.sumelectthermal: -1123.771382 hartree
zpe.sumelectthermalent: -1123.770438 hartree
zpe.sumelectthermalfe: -1123.841945 hartree
dipole: -7.1331 -0.1829 -1.3894
dipole: 7.2695
quadrupole: -70.2759 -80.9066 -150.9877
quadrupole: 20.8077 -11.6575 1.8749
quadrupole: 30.4475 19.8168 -50.2643 20.8077 -11.6575 1.8749
hfenergy: -1124.1391271 hartree
pointgroup: C01 [X(C21H18N3O2)]
dipole: -2.8005079 -0.229087 -0.5333015 debye
polarizability: 423.2621678|58.5486927|329.4605014|0.4984178|0.0151144|147.8625277 unknown
InChI: InChI=1S/C21H18N3O2/c1-24-19-11-15(23)7-9-17(19)16-8-6-14(22)10-18(16)20(24)12-2-4-13(5-3-12)21(25)26/h2-11,25H,22-23H2,1H3
charge 1 multiplicity 1
44 atoms
O  6.318286 -0.757329 -1.212519
O  6.425023 -0.737003 1.112229
N  -0.847605 -1.293777 0.002715
N  0.437789 4.728101 -0.004146
N  -5.238354 -3.476155 0.007529
C  -0.051147 -0.175287 -0.000282
C  -0.629955 1.138167 -0.002507
C  -2.072259 1.269974 -0.002836
C  -2.26868 -1.219841 0.002044
C  -2.887988 0.081049 -0.001005
C  1.438991 -0.338771 0.001224
C  0.209734 2.294149 -0.003728
C  -3.045531 -2.405045 0.004797
C  -2.609541 2.596288 -0.004547
C  -4.320495 0.115022 -0.001415
C  -0.233422 -2.651787 0.008221
C  -0.346211 3.589371 -0.004334
C  -4.45973 -2.335986 0.00461
C  -1.783772 3.714751 -0.005184
C  -5.087707 -1.041394 0.001248
C  2.148979 -0.378012 1.230572
C  2.150586 -0.400055 -1.225506
C  3.552387 -0.496805 1.230944
C  3.555644 -0.519324 -1.224712
C  4.25937 -0.569948 0.00424
C  5.74834 -0.69502 0.060515
H  1.295976 2.167522 -0.003422
H  -2.575191 -3.389868 0.007293
H  -3.691172 2.751938 -0.004965
H  -4.835866 1.078496 -0.00381
H  0.858286 -2.565748 0.010227
H  -0.551442 -3.199449 0.910666
H  -0.547849 -3.205503 -0.891806
H  -2.229074 4.716571 -0.006093
H  -6.181131 -0.973996 0.000953
H  1.605129 -0.31259 2.179103
H  1.607391 -0.351369 -2.175514
H  4.118144 -0.531848 2.167479
H  4.113462 -0.570912 -2.163421
H  1.453264 4.67045 -0.001193
H  0.019059 5.654888 -0.003388
H  -6.253927 -3.415545 0.007753
H  -4.823878 -4.405285 0.01067
H  7.30689 -0.840083 -1.137395
