program: Gaussian 09
title: 000171784
version: EM64L-G09RevD.01
frameworkgroup: C1[X(C12H16N2O4)]
method: RPBEPBE
basis: SDD
operation: Freq
keyword: #p
keyword: freq=noraman
keyword: PBEPBE/SDD
title: #p freq=noraman PBEPBE/SDD
converged: YES YES NO NO
title: Mulliken charges:
elementType: O O O O N N C C C C C C C C C C C C H H H H H H H H H H H H H H H H
charge: -0.292655 -0.213935 -0.188350 -0.231748 -0.188618 -0.381543 0.388378 -0.144836 -0.030005 -0.516975 -0.438916 -0.414305 -0.399282 -0.726854 0.196574 0.130896 0.182881 -0.595036 0.227563 0.208053 0.252356 0.222248 0.212713 0.207432 0.208912 0.225241 0.207644 0.239190 0.221760 0.285242 0.365981 0.256492 0.270302 0.253200
chargesum: 0.00000
title: Mulliken charges with hydrogens summed into heavy atoms:
elementType: O O O O N N C C C C C C C C C C C C
charge: -0.292655 -0.213935 -0.188350 -0.231748 -0.188618 -0.015562 0.388378 0.082726 -0.030005 -0.056565 -0.003954 0.002039 0.033603 0.019338 0.196574 0.130896 0.182881 0.184958
polarizability: 1.71925040e+02 -5.06893812e+00 1.41344511e+02 -1.69814310e+01 -4.82931840e+00 1.29473049e+02
1716.lowfreq: -0.0008 -0.0007 -0.0004 2.0175 5.6427 16.1449 23.2645 45.7554 65.8899
frequency: 23.2453 45.3551 65.8086 92.1203 119.4562 122.4121 149.4258 165.5625 190.5293 214.2768 248.2092 260.4984 282.0383 282.7910 309.6658 331.2349 361.8061 374.2381 383.4112 394.4871 430.9680 437.9782 454.3430 523.1976 565.9661 613.3713 631.9373 671.1587 687.4240 707.5851 711.6796 734.0142 777.6163 792.8555 819.4778 824.9614 839.0192 873.4992 912.9093 925.4592 938.7841 958.0715 1010.9939 1033.1904 1041.1548 1071.0787 1087.9814 1099.5136 1130.7726 1131.6375 1150.8828 1155.9141 1172.9949 1177.5931 1191.0815 1248.7900 1250.7367 1273.7961 1295.5105 1314.6375 1337.8372 1347.6287 1348.2465 1358.5593 1363.2347 1377.3894 1385.5848 1414.4924 1433.3678 1450.9363 1456.9589 1463.0981 1468.0298 1474.3497 1475.2610 1482.0253 1485.5548 1582.2351 1646.0428 1655.7068 2974.0552 2977.5511 2984.1803 2999.0476 3006.0546 3019.7739 3032.5748 3035.6541 3049.1388 3063.3346 3103.0707 3111.9623 3117.1709 3134.7001 3150.4919 3512.1917
redmass: 7.3973 3.9082 3.7883 3.9012 1.0805 4.1913 4.7696 4.7295 1.8209 1.6536 3.4600 3.8174 3.0230 2.7464 2.0824 3.7972 4.1436 7.2471 4.9415 7.6772 2.9649 8.7964 2.8592 6.7678 4.0482 5.0504 3.8299 2.8773 4.5757 6.1550 9.0421 3.8313 1.8281 2.2745 1.9229 3.5253 2.8688 2.0005 2.7113 2.1033 2.3660 2.0567 2.2729 1.9496 1.6672 2.1423 2.7913 1.7552 1.3600 1.9392 2.9859 2.2526 1.5603 1.4355 3.1480 3.9302 1.2826 1.2711 1.4951 4.3412 1.4572 1.4631 1.5640 4.8142 1.5922 1.5248 1.3625 2.2630 1.2737 1.0921 1.1033 1.1274 1.0922 1.0568 1.0759 1.0944 1.0553 10.4994 6.2837 8.0648 1.0623 1.0607 1.0627 1.0627 1.0354 1.0333 1.0989 1.0975 1.1001 1.1037 1.0984 1.1024 1.0899 1.1019 1.1024 1.0766
irintensity: 0.8046 0.7841 0.2430 1.3691 0.0417 0.8239 14.2023 1.0674 0.4323 1.4082 3.1448 2.7462 2.3132 3.1739 2.0690 4.9534 8.2065 31.3304 8.6979 4.1890 5.4936 6.9013 2.1663 27.9558 3.5765 2.8884 5.1198 14.3835 9.7994 0.2317 4.7995 10.8093 77.5153 29.8468 16.3947 13.0075 8.1091 8.9341 10.3157 6.2678 11.2356 10.2420 23.4495 16.2744 33.6574 1.1523 5.0342 3.6281 0.8283 3.8340 6.1162 7.3395 8.4821 1.0166 60.2005 40.0472 1.1032 3.3109 16.8582 261.8208 9.5279 0.7322 3.0188 192.2722 3.8568 23.8184 26.2958 8.2224 116.1266 12.2042 19.5564 8.5301 11.0831 8.9196 18.6416 16.2264 19.0249 333.7448 309.4756 249.6663 23.6991 30.1469 34.5981 30.5437 15.3554 18.7258 36.0213 12.5980 43.7921 42.7767 13.6219 13.5577 16.9408 3.0306 0.4317 65.5275
temp: 298.150 k
press: 1.00000 atm
elementType: 8 8 8 8 7 7 6 6 6 6 6 6 6 6 6 6 6 6 1 1 1 1 1 1 1 1 1 1 1 1 1 1 1 1
symmnumber: 1
zpe: 713958.9 jmol-1
zpe.correction: 0.271933 hartree
zpe.thermalcorrener: 0.288974 hartree
zpe.thermalcorrenthalpy: 0.289919 hartree
zpe.thermalcorrgfe: 0.227123 hartree
zpe.sumelectzpe: -875.925477 hartree
zpe.sumelectthermal: -875.908435 hartree
zpe.sumelectthermalent: -875.907491 hartree
zpe.sumelectthermalfe: -875.970286 hartree
dipole: -0.1600 -2.8331 0.0926
dipole: 2.8391
quadrupole: -108.8376 -113.8065 -104.7732
quadrupole: 6.6793 5.5531 2.8130
quadrupole: 0.3015 -4.6674 4.3659 6.6793 5.5531 2.8130
hfenergy: -876.1974092 hartree
pointgroup: C01 [X(C12H16N2O4)]
dipole: 0.0909121 1.0925921 -0.2135961 debye
polarizability: 169.1015715|-1.4763646|142.9015538|20.7047318|1.3774116|130.7394749 unknown
InChI: InChI=1S/C12H16N2O4/c1-11(12-6-4-3-5-7(12)18-12)8(15)13-10(17)14(2)9(11)16/h7,13H,3-6H2,1-2H3
charge 0 multiplicity 1
34 atoms
O  2.257869 -1.232473 0.932175
O  -0.450782 1.866535 1.387909
O  -0.555035 -2.837674 0.132849
O  -3.662819 0.157766 -1.532819
N  -2.023783 1.035472 -0.089202
N  -2.062285 -1.280654 -0.66007
C  1.220596 -0.355185 0.284915
C  2.289322 0.278298 1.12902
C  -0.231155 -0.511679 0.868251
C  1.31479 -0.297763 -1.246972
C  3.464173 1.006798 0.504075
C  2.388599 0.689807 -1.76982
C  3.703074 0.591378 -0.965553
C  -0.215527 -0.923654 2.369829
C  -0.898937 0.874643 0.751334
C  -0.934397 -1.641165 0.100192
C  -2.649173 -0.011994 -0.808445
C  -2.613913 2.393941 -0.184793
H  2.028866 0.577751 2.151076
H  0.332175 -0.025586 -1.680298
H  1.54219 -1.322923 -1.597029
H  4.368708 0.822385 1.115403
H  3.252473 2.094316 0.559652
H  2.004179 1.727695 -1.698718
H  2.572573 0.486945 -2.841513
H  4.083458 -0.447051 -0.998585
H  4.476148 1.243167 -1.413114
H  0.16157 -0.093641 2.987627
H  -1.234257 -1.173618 2.715043
H  0.43316 -1.805594 2.485743
H  -2.532906 -2.035895 -1.17062
H  -2.957843 2.72296 0.809077
H  -3.458044 2.347674 -0.886604
H  -1.851568 3.104918 -0.540816
