program: Gaussian 09
title: 000016354
version: EM64L-G09RevD.01
frameworkgroup: C1[X(C15H17N3)]
method: RPBEPBE
basis: SDD
operation: Freq
keyword: #pfreq=noraman
keyword: PBEPBE/SDD
title: #p freq=noraman PBEPBE/SDD
converged: YES YES NO NO
title: Mulliken charges:
elementType: N N N C C C C C C C C C C C C C C C H H H H H H H H H H H H H H H H H
charge: -0.149105 -0.110857 -0.139682 0.440119 -0.392299 -0.660386 -0.345801 -0.321416 -0.658756 -0.365265 -0.321422 0.145945 0.179771 -0.349388 -0.304601 -0.206368 -0.203595 -0.244920 0.218754 0.229470 0.239563 0.226456 0.239082 0.239565 0.226156 0.242429 0.220513 0.217860 0.244900 0.271783 0.245692 0.271691 0.225471 0.222963 0.225678
chargesum: 0.00000
title: Mulliken charges with hydrogens summed into heavy atoms:
elementType: N N N C C C C C C C C C C C C C C C
charge: -0.149105 -0.110857 -0.139682 0.440119 0.055925 0.044715 -0.106236 -0.095260 0.022046 -0.120365 -0.049638 0.145945 0.179771 -0.103696 -0.032910 0.019103 0.019368 -0.019241
polarizability: 5.05393145e+02 -1.39953206e+01 1.76304098e+02 -5.57943634e+00 -8.21519189e+00 8.79991462e+01
1716.lowfreq: -5.4072 -0.0009 -0.0007 -0.0003 5.2882 8.5095 25.9932 33.9057 54.4724
frequency: 25.9276 33.8110 54.4247 56.2185 85.8230 93.4159 141.1328 170.7070 181.5175 207.0896 222.4879 230.1853 272.6709 304.7317 361.0618 398.1278 407.0184 408.5803 434.6352 480.4985 503.9540 513.9750 526.4723 548.4454 608.4664 615.2567 632.6818 693.7620 711.1546 741.4287 780.1521 788.8263 805.9364 816.3474 831.3614 852.0004 888.3481 898.0599 935.2257 962.4478 981.4872 984.1263 984.4365 987.3268 992.4692 997.7257 1014.2566 1067.2552 1073.3587 1082.6202 1104.9609 1120.4588 1141.3071 1160.6101 1160.9965 1167.7479 1193.5744 1229.6253 1254.5998 1280.3751 1303.2315 1307.2198 1337.3177 1344.7984 1375.2756 1379.1618 1387.8381 1389.9834 1441.1156 1442.7793 1456.3743 1464.1933 1467.9205 1472.1599 1479.3085 1494.8169 1501.4929 1517.3817 1550.8122 1581.1939 1601.3077 1623.6832 2952.2796 2985.0652 3000.3855 3020.0775 3048.7604 3082.0948 3093.4907 3100.3957 3122.8179 3133.6643 3145.6351 3147.2586 3149.1545 3162.1017 3167.4623 3168.9862 3173.5661
redmass: 3.6101 4.3176 2.9758 4.5108 3.3741 3.7151 4.1159 2.0463 2.1152 1.7154 2.0372 2.2570 5.8102 3.4134 4.4301 3.4535 3.8441 3.0045 3.4659 3.3615 2.9886 3.6048 4.8817 2.5243 6.2555 5.3447 6.9461 1.8709 4.8332 3.5368 1.8087 1.1755 1.2780 5.3396 1.7617 1.2462 2.3638 7.3608 1.4473 1.3576 1.3868 1.3644 6.1184 2.6986 2.6948 1.3172 2.0670 1.8571 1.4880 1.6819 1.3028 1.4338 1.9589 1.3836 1.6385 1.0609 1.6268 2.3804 2.7797 1.3900 1.4135 1.5290 3.2176 1.5807 4.5349 2.1625 6.9358 1.2911 1.7728 1.5225 3.2058 2.2301 1.0651 1.0448 1.0656 1.1015 1.4368 1.8903 6.1954 6.2319 6.2658 6.3348 1.0372 1.0356 1.0610 1.1012 1.1025 1.0995 1.1012 1.0963 1.0847 1.0887 1.0880 1.0865 1.0930 1.0961 1.0954 1.0990 1.0953
irintensity: 0.2367 1.8661 0.1461 1.4581 0.8497 0.5775 2.2369 0.5483 2.6184 0.0529 0.9642 0.5834 0.3314 1.8958 4.0131 1.9610 6.6403 0.6116 0.3791 8.5747 5.0676 13.5309 14.2141 28.8631 0.9968 4.8113 0.6441 51.5574 0.8569 11.2012 38.4090 16.7933 2.5364 1.4388 84.1017 0.0219 2.8524 0.5861 7.8140 2.3876 6.5670 0.2005 0.1814 1.2668 43.2473 1.0990 11.3176 22.4154 11.9129 37.2050 3.0962 3.4534 64.3666 157.5851 16.7232 0.5227 18.5393 29.1597 9.5224 88.9368 2.2954 77.4926 370.8059 7.5527 3.3681 176.3331 3.0582 18.3846 0.5781 14.8532 9.2773 11.7715 6.5363 17.0699 1.3146 32.7713 20.4881 150.0151 58.1481 4.2783 6.8346 578.4372 128.2436 33.5182 74.8500 36.4758 7.0596 48.4866 35.2490 38.3439 4.4556 13.3348 8.6432 7.1895 29.1653 26.2119 23.1946 36.1891 21.2576
temp: 298.150 k
press: 1.00000 atm
elementType: 7 7 7 6 6 6 6 6 6 6 6 6 6 6 6 6 6 6 1 1 1 1 1 1 1 1 1 1 1 1 1 1 1 1 1
symmnumber: 1
zpe: 752309.0 jmol-1
zpe.correction: 0.286539 hartree
zpe.thermalcorrener: 0.303311 hartree
zpe.thermalcorrenthalpy: 0.304255 hartree
zpe.thermalcorrgfe: 0.240484 hartree
zpe.sumelectzpe: -744.708877 hartree
zpe.sumelectthermal: -744.692105 hartree
zpe.sumelectthermalent: -744.691161 hartree
zpe.sumelectthermalfe: -744.754932 hartree
dipole: 5.5187 0.0720 0.0470
dipole: 5.5194
quadrupole: -69.6404 -95.9747 -113.2167
quadrupole: -0.6992 -0.9450 -2.1890
quadrupole: 23.3035 -3.0308 -20.2728 -0.6992 -0.9450 -2.1890
hfenergy: -744.9954165 hartree
pointgroup: C01 [X(C15H17N3)]
dipole: 2.1699587 0.0137003 0.080574 debye
polarizability: 505.8745279|-4.5520883|134.8320214|-6.1935253|44.6818737|128.9898407 unknown
InChI: InChI=1S/C15H17N3/c1-3-18(2)15-11-9-14(10-12-15)17-16-13-7-5-4-6-8-13/h4-12H,3H2,1-2H3
charge 0 multiplicity 1
35 atoms
N  4.530206 0.09326 -0.233529
N  -1.127546 -0.390861 -0.488392
N  -1.866322 0.416371 0.243398
C  3.138351 -0.007176 -0.262012
C  5.224281 1.074276 0.627191
C  5.35179 -0.873424 -0.9781
C  2.489328 -0.972143 -1.102407
C  2.301295 0.848719 0.538282
C  5.428415 0.589308 2.08181
C  1.091446 -1.060674 -1.144478
C  0.908389 0.754576 0.485628
C  0.271419 -0.204384 -0.35958
C  -3.277457 0.209108 0.103056
C  -4.097771 1.075693 0.874515
C  -3.882179 -0.777101 -0.729779
C  -5.502909 0.963618 0.817775
C  -5.284837 -0.882646 -0.780244
C  -6.10204 -0.015811 -0.009415
H  6.206189 1.291293 0.167697
H  4.664966 2.027455 0.616784
H  5.134353 -1.917969 -0.678736
H  6.416443 -0.677105 -0.774726
H  5.191321 -0.788949 -2.071423
H  3.080587 -1.646092 -1.727418
H  2.750332 1.585118 1.21101
H  4.461029 0.363137 2.562965
H  6.044534 -0.327438 2.10935
H  5.940642 1.365751 2.679808
H  0.59669 -1.794944 -1.789464
H  0.277073 1.407994 1.096139
H  -3.607139 1.823854 1.506359
H  -3.233631 -1.435485 -1.315851
H  -6.12944 1.635429 1.415136
H  -5.751131 -1.640761 -1.420432
H  -7.193377 -0.105402 -0.054718
