program: Gaussian 09
title: 000171765
version: EM64L-G09RevD.01
frameworkgroup: C1[X(C14H20N2O4)]
method: RPBEPBE
basis: SDD
operation: Freq
keyword: #p
keyword: freq=noraman
keyword: PBEPBE/SDD
title: #p freq=noraman PBEPBE/SDD
converged: YES YES NO NO
title: Mulliken charges:
elementType: O O O O N N C C C C C C C C C C C C C C H H H H H H H H H H H H H H H H H H H H
charge: -0.287372 -0.321042 -0.336931 -0.378733 -0.387561 -0.337449 -0.010351 -0.486416 -0.194816 -0.716783 -0.708258 0.256940 0.328382 -0.427118 0.476235 -0.373574 -0.396204 -0.222995 -0.223727 -0.230060 0.195902 0.233185 0.234503 0.291227 0.221980 0.217044 0.210740 0.216125 0.210956 0.215484 0.335223 0.384774 0.239969 0.232374 0.237256 0.234120 0.373753 0.230542 0.230179 0.232499
chargesum: 0.00000
title: Mulliken charges with hydrogens summed into heavy atoms:
elementType: O O O O N N C C C C C C C C C C C C C C
charge: -0.287372 -0.321042 -0.336931 -0.004979 -0.052338 0.047325 0.185551 -0.018728 0.096411 -0.067019 -0.065693 0.256940 0.328382 0.045225 0.476235 -0.136318 -0.162084 0.007547 0.006452 0.002438
polarizability: 2.16321948e+02 1.51913309e+01 1.77190487e+02 -4.85204763e+00 6.77130746e+00 1.48312609e+02
1716.lowfreq: -27.0845 -24.9051 -14.5256 -9.8032 -6.0742 -0.0003 0.0003 0.0006 6.8983
frequency: -26.5298 -18.7998 -12.0274 33.6154 43.1793 54.0130 72.3734 79.4228 114.7641 123.9439 142.2714 188.6086 193.0133 202.2794 224.6892 232.6538 256.7997 260.2859 301.3920 317.7018 325.7435 339.6784 396.1455 402.4361 407.4830 438.4191 488.8616 510.3806 524.6279 541.3173 561.9785 616.2144 641.0092 689.1473 697.5024 706.4911 737.7528 755.7331 762.6465 820.6761 832.1018 842.2169 854.4091 872.9256 911.6710 925.6757 930.2253 946.3052 951.8262 956.5072 967.0167 978.3873 991.3382 996.9694 999.4098 1026.1256 1035.0397 1089.0501 1107.9713 1133.7085 1156.8739 1174.0108 1176.5418 1188.4148 1191.3576 1197.9589 1217.3532 1228.4252 1253.0576 1267.4020 1300.9449 1325.9415 1333.0492 1336.5733 1348.6464 1354.8640 1358.5842 1378.6096 1386.1436 1396.2453 1440.0206 1453.3886 1466.8214 1470.2333 1473.9618 1478.9556 1481.8338 1487.6445 1487.9540 1494.7438 1567.4133 1596.2599 1617.1393 1621.6529 2959.3619 2969.3213 2972.2490 2993.6779 3011.6371 3018.7992 3055.3865 3061.7444 3069.5165 3069.9921 3074.8004 3084.0922 3123.3384 3125.9469 3137.7861 3150.6179 3166.4798 3266.6239 3378.5097 3558.3058
redmass: 3.8744 2.8399 3.5449 4.9945 6.8292 5.9905 3.5852 5.7960 5.1367 7.6390 4.1261 5.2174 1.5389 1.7955 3.0333 1.5626 4.0398 6.2130 2.9949 2.9736 3.7888 5.4164 2.3810 2.7946 2.0694 3.4974 1.3717 2.5194 1.9987 1.6268 5.0043 6.3422 3.1443 5.3893 4.3027 2.0716 1.4108 3.2344 2.5712 2.9156 2.9799 2.2319 1.2474 3.7211 1.1826 3.3021 1.6194 2.0191 1.6942 1.7219 2.7309 1.3929 6.2164 5.3026 1.3273 2.1829 2.3801 1.5243 2.8734 2.3602 2.5367 1.0545 1.7862 1.1266 1.1044 1.5914 1.9826 2.3370 1.7845 1.3142 1.3794 1.2795 1.2570 1.3522 1.4474 1.4961 1.6512 1.2142 8.4205 1.2161 2.1760 1.1632 1.0657 1.0993 1.1809 1.4744 1.0915 1.4680 1.4489 1.6860 6.6374 6.1059 6.1548 6.3715 1.0830 1.0357 1.0363 1.0639 1.0817 1.0576 1.1001 1.0997 1.0993 1.0991 1.0988 1.1082 1.0860 1.0879 1.0920 1.0963 1.1017 1.0637 1.0888 1.0778
irintensity: 0.2212 0.2228 0.1018 0.5029 0.7938 0.2055 0.7751 2.5517 0.8304 7.4141 2.9018 4.1221 0.2288 1.0165 1.1581 0.9475 7.9437 31.3682 3.7208 7.2753 12.2602 5.8517 0.4587 0.1470 1.2293 1.1787 100.3590 24.9010 35.7797 96.2263 11.2203 0.1944 95.5550 8.6573 30.4930 50.1006 187.9553 16.5472 56.0864 6.6030 12.8666 27.2892 0.0327 27.3701 7.0996 50.7611 7.7540 47.5952 12.3179 20.0103 64.9559 0.0165 1.7960 104.9229 0.0954 6.9514 110.2198 7.1490 21.5510 25.0253 17.6689 0.0059 17.9940 8.7649 4.8792 141.9186 170.9466 7.8014 112.6836 7.1508 6.6233 2.0243 23.8111 6.7639 42.9769 10.3199 152.0257 18.8010 1.0741 16.4292 10.9709 86.2273 27.0657 46.3351 83.2330 175.1334 40.0646 48.4061 15.5901 40.1993 105.4858 0.7625 4.6517 261.8582 26.9960 37.6645 21.8463 10.1240 8.6019 20.4112 6.4905 16.1447 36.8829 67.3973 73.4198 12.3524 4.9630 2.0578 13.9643 37.0829 19.5883 11.3699 309.2898 36.2119
temp: 298.150 k
press: 1.00000 atm
elementType: 8 8 8 8 7 7 6 6 6 6 6 6 6 6 6 6 6 6 6 6 1 1 1 1 1 1 1 1 1 1 1 1 1 1 1 1 1 1 1 1
symmnumber: 1
zpe: 852407.1 jmol-1
zpe.correction: 0.324665 hartree
zpe.thermalcorrener: 0.343342 hartree
zpe.thermalcorrenthalpy: 0.344286 hartree
zpe.thermalcorrgfe: 0.277080 hartree
zpe.sumelectzpe: -954.343363 hartree
zpe.sumelectthermal: -954.324686 hartree
zpe.sumelectthermalent: -954.323742 hartree
zpe.sumelectthermalfe: -954.390948 hartree
dipole: 3.2202 3.8189 0.0636
dipole: 4.9958
quadrupole: -113.0853 -123.4410 -120.6875
quadrupole: -8.3468 -6.4159 3.5861
quadrupole: 5.9860 -4.3697 -1.6162 -8.3468 -6.4159 3.5861
hfenergy: -954.6680278 hartree
pointgroup: C01 [X(C14H20N2O4)]
dipole: -1.3549341 1.4211363 0.0878406 debye
polarizability: 217.9307335|-12.3998208|176.371745|-5.8647099|-4.9304052|147.5225657 unknown
InChI: InChI=1S/C14H20N2O4/c1-10(2)8-12(13(17)16-19)15-14(18)20-9-11-6-4-3-5-7-11/h3-7,10,12,15-16,19H,8-9H2,1-2H3
charge 0 multiplicity 1
40 atoms
O  -1.003818 0.010502 -0.347338
O  3.992977 -1.586593 1.128994
O  0.5457 -1.035071 -1.78503
O  3.154364 -3.645648 -0.365238
N  1.223734 0.223052 0.072597
N  2.764911 -2.296145 -0.67264
C  3.09324 2.648085 0.25247
C  3.451427 1.179447 0.603459
C  2.676635 0.110836 -0.19184
C  3.402311 2.989634 -1.224852
C  3.853891 3.603853 1.202621
C  3.19962 -1.30552 0.160525
C  0.285252 -0.321797 -0.765748
C  -2.117458 -0.581299 -1.172424
C  -3.410939 -0.295174 -0.452523
C  -3.838919 -1.128208 0.612492
C  -4.214905 0.809467 -0.828743
C  -5.046093 -0.858486 1.293145
C  -5.425167 1.080768 -0.151743
C  -5.84238 0.247249 0.911521
H  2.005267 2.802322 0.415933
H  3.300781 0.996799 1.685604
H  4.530053 1.014619 0.423113
H  2.824378 0.261307 -1.277926
H  2.796867 2.390944 -1.929824
H  3.189657 4.054601 -1.431046
H  4.470817 2.808811 -1.452032
H  3.59312 4.658373 0.997723
H  4.947871 3.494965 1.073207
H  3.618102 3.393826 2.262695
H  0.90222 0.715208 0.907947
H  2.017195 -2.20338 -1.379411
H  -1.916925 -1.661683 -1.280862
H  -2.079524 -0.113892 -2.171726
H  -3.223068 -1.985887 0.908869
H  -3.891488 1.458752 -1.651429
H  3.764964 -3.494248 0.42704
H  -5.368169 -1.508367 2.114177
H  -6.040237 1.93609 -0.452247
H  -6.781564 0.454887 1.436392
