program: Gaussian 09
title: 000171673
version: EM64L-G09RevD.01
frameworkgroup: C1[X(C8H12O4)]
method: RPBEPBE
basis: SDD
operation: Freq
keyword: #pfreq=noraman
keyword: PBEPBE/SDD
title: #p freq=noraman PBEPBE/SDD
converged: NO YES NO NO
title: Mulliken charges:
elementType: O O O O C C C C C C C C H H H H H H H H H H H H
charge: -0.286913 -0.246913 -0.418790 -0.235657 0.033581 -0.378100 -0.718900 -0.698060 0.269216 -0.269308 -0.225249 0.180987 0.243882 0.218217 0.199026 0.235270 0.216538 0.251991 0.238529 0.216377 0.217203 0.285801 0.288054 0.383218
chargesum: 0.00000
title: Mulliken charges with hydrogens summed into heavy atoms:
elementType: O O O O C C C C C C C C
charge: -0.286913 -0.246913 -0.035573 -0.235657 0.277463 0.039143 -0.015101 -0.025951 0.269216 0.016493 0.062804 0.180987
polarizability: 1.61163107e+02 -1.41763235e+00 9.64655058e+01 1.10544408e-01 3.26529006e+00 6.46885831e+01
1716.lowfreq: -17.0657 -2.4505 -0.0007 -0.0003 0.0007 4.3280 31.1210 46.6980 60.3404
frequency: 31.0813 46.6925 60.3370 75.8799 101.8048 155.1187 168.1132 194.2142 202.7547 229.4818 260.0341 266.2194 281.5696 372.8979 412.7725 499.1863 552.9859 571.4619 578.5456 649.1391 700.7555 728.4273 751.9131 798.8266 839.9390 913.1003 918.9615 956.8406 965.6149 991.4087 1010.4351 1010.8771 1058.2206 1104.6385 1127.2383 1149.4405 1164.5563 1223.1395 1270.3918 1283.1120 1320.2721 1327.4590 1340.3013 1356.0951 1385.5133 1392.4053 1456.2289 1464.7467 1478.0981 1486.5988 1493.5766 1607.8076 1640.0439 1663.1274 2985.9558 2990.5319 2995.8412 3024.3587 3041.1521 3081.4526 3091.2984 3094.9865 3107.7573 3161.3667 3168.1681 3522.2852
redmass: 5.5088 4.3428 4.3729 5.3402 2.9274 4.1170 2.4785 2.5677 1.3389 2.1076 2.1026 2.1913 5.1077 2.7836 3.4251 3.6508 3.0089 1.8621 4.5584 1.8560 6.0239 8.8236 1.7440 1.9623 2.5842 6.0058 2.1530 3.0114 2.2021 1.5652 1.3407 1.0939 2.2268 1.9023 2.5107 1.9010 1.9896 1.4244 1.1428 1.5537 1.7638 2.2302 1.4274 1.3597 1.2492 1.2149 1.0722 1.0536 1.0468 1.0493 1.0519 10.9238 8.6835 6.6599 1.0582 1.0384 1.0372 1.0857 1.0998 1.0994 1.0980 1.1004 1.1009 1.0963 1.0897 1.0641
irintensity: 0.7034 2.2736 0.5751 0.9866 0.7036 0.3289 2.7767 3.1972 1.5213 3.3964 0.6875 0.1255 6.7081 3.9916 8.8693 20.8065 20.7207 76.0863 29.4339 75.7913 0.4931 39.7390 1.5452 20.3982 12.1147 83.3393 0.7054 11.7187 65.3752 15.2042 20.4834 61.4012 267.5831 77.4088 249.3285 20.6891 6.9483 89.7418 0.5985 176.8816 22.6959 146.5633 22.1524 0.0853 28.5203 20.1185 5.6085 8.3196 22.1051 13.5277 4.4145 165.7899 177.6845 4.3299 29.6249 18.7248 19.8273 18.5845 14.6837 47.8768 22.4915 47.6335 18.0300 0.1420 0.6439 51.4737
temp: 298.150 k
press: 1.00000 atm
elementType: 8 8 8 8 6 6 6 6 6 6 6 6 1 1 1 1 1 1 1 1 1 1 1 1
symmnumber: 1
zpe: 498576.9 jmol-1
zpe.correction: 0.189898 hartree
zpe.thermalcorrener: 0.203569 hartree
zpe.thermalcorrenthalpy: 0.204513 hartree
zpe.thermalcorrgfe: 0.148073 hartree
zpe.sumelectzpe: -612.008777 hartree
zpe.sumelectthermal: -611.995106 hartree
zpe.sumelectthermalent: -611.994162 hartree
zpe.sumelectthermalfe: -612.050602 hartree
dipole: -1.5079 0.2079 0.0521
dipole: 1.5230
quadrupole: -53.0387 -81.3498 -70.8609
quadrupole: -1.5512 0.2977 -2.2472
quadrupole: 15.3778 -12.9333 -2.4444 -1.5512 0.2977 -2.2472
hfenergy: -612.1986751 hartree
pointgroup: C01 [X(C8H12O4)]
dipole: 0.5919624 -0.0815028 0.0446486 debye
dipolederiv: -1.7827787 0.2842311 -0.1419078 0.3166343 -0.565066 0.0441993 -0.0641742 0.0138967 -0.3289933 -0.7484532 -0.0644719 0.006629 0.1330665 -0.826277 0.1769079 -0.0492554 0.1655115 -0.3716164 -1.2184055 0.4859623 -0.1567522 0.4287959 -0.5054559 0.0233798 -0.1324624 0.0220854 -0.4379689 -0.7505456 -0.1280209 0.0379613 -0.1153043 -0.8854892 0.1741019 0.0377792 0.1780144 -0.3780882 1.0781374 -0.0523999 0.0589976 0.1726702 0.2502293 0.0923665 -0.1208649 0.1329718 0.3297793 0.0321913 0.0327669 -0.0104678 -0.0109633 0.0688272 -0.0367523 0.0253016 -0.04068 0.0781254 -0.14764 0.0345464 -0.0177612 -0.0273495 -0.0412811 -0.0947271 0.0358132 -0.1397516 -0.0875067 0.0445294 0.0288197 0.0100744 0.0454981 -0.0256601 0.058263 0.0318204 0.0634782 0.0050755 1.969182 -0.1355798 0.0872471 -0.3735771 1.0258368 -0.2825199 0.129264 -0.2473478 0.3227865 -0.3128173 -0.0678167 0.0220274 -0.1288266 0.0129908 -0.0315779 0.0284446 -0.0289584 -0.0876409 -0.5903268 -0.0958742 0.0232387 -0.1992601 0.0138337 -0.0379243 0.0656305 -0.0354973 -0.0883865 1.9985513 -0.1614746 0.0570855 0.0531707 1.1477544 -0.2782674 -0.0222363 -0.2839603 0.3394772 -0.0347893 0.0441439 -0.0530241 -0.0396231 -0.0111021 0.0721958 0.0117966 0.0506622 -0.0618967 0.0801906 -0.0228587 -0.0903719 0.0088964 -0.0080666 -0.0847371 -0.0811316 -0.0565099 -0.1162118 -0.1538964 -0.0656897 0.0683888 -0.0608063 -0.0101261 0.0643516 0.0349066 0.0510248 0.06404 0.115567 -0.0255639 0.0001467 -0.0030896 0.012943 0.1242377 -0.0190096 0.0739849 -0.0494787 -0.1504129 -0.0909526 0.009581 -0.1025663 0.0956985 -0.0021385 -0.01213 0.0148805 0.0742093 0.0510801 0.1247683 0.0367748 0.1105024 -0.0283384 -0.0455514 0.0299275 -0.0155608 0.0786034 -0.0582711 -0.1078609 0.0667595 -0.0925145 0.0762474 0.0330496 0.0528583 0.0370969 0.0579562 0.0499387 -0.0480258 -0.0890898 -0.0786122 0.0450484 -0.0872472 -0.1004049 -0.046884 -0.0994755 -0.0136718 0.1394179 0.037757 0.1497704 -0.0842624 -0.039889 0.0558185 -0.069085 0.0599367 0.107773 -0.0011288 0.0006999 -0.0230632 0.0228227 0.045884 0.0105765 0.0471329 0.1549686 0.1147704 -0.0121533 0.0050253 -0.0259386 0.0283334 0.0449177 0.0080939 0.0457993 0.1594937 0.3200975 -0.0947851 0.0309807 -0.1375101 0.1905592 0.0674775 0.0436379 0.0676953 0.3828118 unknown
polarizability: 161.0980977|-1.6350207|94.9377647|2.1012578|-7.6142312|66.2813331 unknown
InChI: InChI=1S/C8H12O4/c1-3-6(2)12-8(11)5-4-7(9)10/h4-6,9H,3H2,1-2H3
charge 0 multiplicity 1
24 atoms
O  1.294325 -0.185503 -0.011269
O  0.235474 1.813842 -0.626226
O  -4.659619 0.406005 -0.159826
O  -3.604263 -1.576054 0.461359
C  2.654757 0.447764 -0.218529
C  3.598545 -0.709994 -0.585295
C  3.024201 1.233175 1.047578
C  3.797652 -1.76723 0.521577
C  0.180917 0.61608 -0.248843
C  -1.060511 -0.164335 0.00339
C  -2.288912 0.396308 -0.165987
C  -3.525329 -0.382653 0.08475
H  2.549547 1.144124 -1.072315
H  3.202747 -1.197387 -1.49662
H  4.574944 -0.264305 -0.862221
H  2.990263 0.587541 1.941047
H  4.04794 1.638811 0.949902
H  2.332676 2.079529 1.193546
H  2.828951 -2.194121 0.834105
H  4.2904 -1.341258 1.413801
H  4.432626 -2.593127 0.15402
H  -0.95391 -1.204555 0.32936
H  -2.39483 1.436035 -0.492225
H  -5.47859 -0.132993 0.01272
