program: Gaussian 09
title: 000171632
version: EM64L-G09RevD.01
frameworkgroup: C1[X(C6H7FN)]
method: RPBEPBE
basis: SDD
operation: Freq
keyword: #p
keyword: freq=noraman
keyword: PBEPBE/SDD
title: #p freq=noraman PBEPBE/SDD
converged: YES YES NO YES
title: Mulliken charges:
elementType: F N C C C C C C H H H H H H H
charge: -0.113859 -0.113248 0.363152 -0.128061 -0.557667 -0.265424 -0.146856 -0.093438 0.299120 0.298020 0.255872 0.298033 0.312025 0.290658 0.301673
chargesum: 1.00000
title: Mulliken charges with hydrogens summed into heavy atoms:
elementType: F N C C C C C C
charge: -0.113859 -0.113248 0.363152 0.171059 0.294258 0.046600 0.143803 0.208235
polarizability: 8.44644933e+01 1.11853798e+00 7.42945650e+01 8.09531370e-05 -9.22320743e-04 3.11749345e+01
1716.lowfreq: -13.1710 -7.6972 -2.7173 -0.0011 -0.0008 -0.0005 86.1646 163.2457 249.8146
frequency: 86.1529 163.2453 249.8132 306.7631 428.9967 434.1986 511.5802 528.1912 574.4805 712.1677 748.0687 785.1225 825.1845 880.4166 961.7234 1011.3234 1030.0230 1059.9048 1121.9287 1139.1310 1161.0295 1188.1676 1258.0461 1304.2297 1349.2157 1420.0460 1455.9564 1458.6614 1465.2651 1503.6062 1570.5539 1627.6336 3031.0119 3135.7031 3160.7718 3184.3928 3196.9408 3204.1505 3214.2744
redmass: 1.0354 3.6360 4.2650 4.0795 4.6242 3.1399 3.2020 6.2839 6.8829 4.1479 5.2580 1.2400 5.9154 1.3275 1.3527 1.3583 2.1160 1.9322 1.3526 1.6758 2.4397 1.1349 3.4089 1.4123 5.1949 1.4060 1.6835 1.0383 1.3123 1.8260 5.5623 6.4032 1.0331 1.1044 1.1049 1.0917 1.0926 1.0980 1.1022
irintensity: 0.6950 4.4304 0.7634 5.1585 6.0184 7.4673 2.4332 3.0015 2.2603 1.3001 1.9634 106.2110 14.6693 2.6083 0.9256 0.4062 0.4858 1.2917 1.4351 20.9463 20.2480 0.5864 26.2923 4.0226 0.5074 12.2483 24.4452 28.0894 4.4635 109.2177 45.9154 91.4115 0.8291 0.0341 1.1880 0.4963 1.2968 16.4281 3.9275
temp: 298.150 k
press: 1.00000 atm
elementType: 9 7 6 6 6 6 6 6 1 1 1 1 1 1 1
symmnumber: 1
zpe: 313709.1 jmol-1
zpe.correction: 0.119486 hartree
zpe.thermalcorrener: 0.126458 hartree
zpe.thermalcorrenthalpy: 0.127402 hartree
zpe.thermalcorrgfe: 0.088151 hartree
zpe.sumelectzpe: -386.586323 hartree
zpe.sumelectthermal: -386.579350 hartree
zpe.sumelectthermalent: -386.578406 hartree
zpe.sumelectthermalfe: -386.617658 hartree
dipole: 1.3733 -2.4556 0.0003
dipole: 2.8135
quadrupole: -26.0014 -30.8705 -45.5623
quadrupole: 5.2215 0.0005 -0.0012
quadrupole: 8.1433 3.2743 -11.4176 5.2215 0.0005 -0.0012
hfenergy: -386.7058081 hartree
pointgroup: C01 [X(C6H7F1N1)]
dipole: -0.6111007 -0.9222426 0.0354333 debye
dipolederiv: -0.7333986 -0.3505235 0.0193599 -0.2710471 -0.3593605 0.0116262 0.0170592 0.0127778 -0.0938883 -0.4089765 0.163121 0.0005684 -0.0366282 -0.2266183 0.0060879 0.006293 0.003321 -0.0356468 1.1283074 0.5089617 -0.0278507 0.1352283 0.5738572 -0.012291 -0.0169469 -0.0176739 0.2199906 0.2544573 -0.2831656 0.0045371 0.1248342 0.1479579 -0.0062487 -0.0073319 -0.0004581 -0.0064734 0.2854051 -0.1173558 0.0013175 -0.1664043 0.2013138 0.0006092 0.0028718 -0.0001406 0.1408515 -0.4869751 -0.239743 0.0126897 0.0629167 0.0576356 -0.0051376 0.0038558 -0.0007944 -0.0885733 -0.0035066 0.3240763 -0.0103726 0.1496526 -0.2793765 0.0039562 -0.0052888 0.0014536 -0.0708577 0.3042761 -0.0073332 -0.0043147 -0.0251257 0.2873382 -0.0084532 -0.0037988 -0.0086964 -0.014142 0.1038798 0.0482271 -0.000382 0.022069 0.0971962 0.0019634 0.0003802 0.0015627 0.1756284 0.0910031 0.0273273 -0.0094296 0.015492 0.0862411 -0.0777924 -0.0247725 -0.0434588 0.0466803 0.0718823 -0.0882469 0.0036712 -0.0104046 -0.0010177 0.0044821 0.0013743 0.0055806 0.1457812 0.0918996 0.0289887 0.0063834 0.0191189 0.0931632 0.0745098 0.0223317 0.0399057 0.0388289 0.121373 -0.0146684 0.0015259 -0.0208445 0.121491 0.0025403 0.0017082 0.0024487 0.1985325 0.098824 -0.0228076 0.0017981 -0.0205989 0.0907503 0.0028569 0.0017226 0.0028968 0.178868 0.0815491 0.0231419 0.0004982 0.0217418 0.1094284 0.0012909 0.0005422 0.0012753 0.1644201 unknown
polarizability: 84.2294192|-1.8869859|74.4837821|-0.7016872|-1.2326741|31.2207915 unknown
InChI: InChI=1S/C6H7FN/c1-8-5-3-2-4-6(8)7/h2-5H,1H3
charge 1 multiplicity 1
15 atoms
F  1.706091 1.39601 -0.074288
N  0.622958 -0.649056 0.000878
C  0.515176 0.719456 -0.037487
C  -0.52822 -1.413547 0.039496
C  1.982632 -1.284358 -0.000188
C  -0.711668 1.387765 -0.039439
C  -1.7889 -0.806517 0.039683
C  -1.887006 0.607471 -0.000039
H  -0.390923 -2.496114 0.068914
H  2.54993 -0.945755 0.880647
H  1.859098 -2.375331 0.03365
H  2.524028 -0.998609 -0.915424
H  -0.724855 2.479529 -0.070956
H  -2.680166 -1.436524 0.070582
H  -2.865076 1.09618 -0.00043
