program: Gaussian 09
title: 000171602
version: EM64L-G09RevD.01
frameworkgroup: C1[X(C10H22O4S)]
method: RPBEPBE
basis: SDD
operation: Freq
keyword: #p
keyword: freq=noraman
keyword: PBEPBE/SDD
title: #p freq=noraman PBEPBE/SDD
converged: YES YES NO NO
title: Mulliken charges:
elementType: S O O O O C C C C C C C C C C H H H H H H H H H H H H H H H H H H H H H H
charge: 1.188831 -0.447970 -0.541465 -0.473564 -0.449836 -0.384323 -0.394057 -0.381776 -0.387244 -0.373470 -0.025810 -0.352829 -0.356696 -0.700815 -0.695788 0.203597 0.199488 0.207645 0.199971 0.194564 0.191478 0.219511 0.224159 0.190764 0.193190 0.250405 0.187040 0.188738 0.195096 0.196351 0.233446 0.235187 0.232749 0.209257 0.216308 0.209992 0.397876
chargesum: 0.00000
title: Mulliken charges with hydrogens summed into heavy atoms:
elementType: S O O O O C C C C C C C C C C
charge: 1.188831 -0.447970 -0.143589 -0.473564 -0.449836 0.018763 0.013559 0.004266 0.056426 0.010484 0.224596 0.022949 0.034750 0.000567 -0.060231
polarizability: 1.90254440e+02 -5.35184188e+00 1.47453849e+02 -2.41931593e+00 2.69041464e+00 1.23049663e+02
1716.lowfreq: -14.0032 -4.0936 0.0016 0.0019 0.0022 4.8564 16.7295 23.4806 31.4784
frequency: 15.7208 23.2515 31.4658 36.1196 54.1536 60.0318 84.7926 94.7480 114.5155 123.3550 134.6835 139.8658 144.7007 169.7187 198.9554 205.3328 232.1365 245.9930 252.1024 288.6917 322.1009 334.0560 340.4375 390.4823 409.9403 437.5349 476.1210 509.2710 564.8883 578.5342 721.8336 727.4156 744.5338 779.0097 793.5568 849.1396 865.9201 883.6960 891.8092 922.8016 982.9474 987.5840 990.3881 1008.6461 1025.5949 1034.1428 1055.6705 1065.7613 1080.3325 1080.9932 1107.5895 1120.0900 1145.1504 1174.1932 1192.6699 1214.9741 1227.3097 1254.7542 1261.3220 1281.7160 1283.6178 1288.0926 1293.2338 1298.1456 1310.5749 1333.9985 1346.9938 1351.6342 1354.9252 1357.4765 1383.0087 1387.0253 1453.3680 1458.0314 1460.1231 1460.8416 1464.7988 1470.4639 1474.9558 1477.2052 1478.0731 1484.1994 1488.0073 2949.6524 2950.2550 2955.4893 2958.2165 2964.8673 2968.4689 2971.4046 2975.6057 2985.0210 2991.7399 2992.3093 2995.9729 3002.2390 3013.8120 3027.6755 3039.2062 3051.4534 3068.2782 3070.7598 3095.3055 3106.9838 3459.5122
redmass: 3.0656 3.8643 3.7205 2.9742 2.6306 4.1319 1.9792 3.0104 2.3152 2.7424 1.9361 2.4604 1.9756 3.9725 1.4233 2.6899 1.1139 3.0311 3.8836 2.8792 3.8275 6.9810 6.7377 4.0595 3.8845 3.7729 2.6248 3.9362 7.1653 12.0050 1.0609 1.0809 1.1401 1.5170 2.0886 1.3405 9.4064 2.1446 2.0018 1.2185 1.4422 3.2126 7.2392 2.5119 2.1734 1.4014 2.2987 2.8194 2.0915 2.3647 1.3374 2.2450 2.3126 2.0571 1.6810 1.2724 1.4202 1.2806 1.2774 1.0341 1.1839 1.2191 1.0776 1.1352 1.2742 1.3773 1.4091 1.5805 1.6203 1.5484 1.2049 1.2171 1.0726 1.0506 1.0716 1.0698 1.0729 1.0776 1.0619 1.0464 1.0780 1.0893 1.0919 1.0589 1.0589 1.0593 1.0594 1.0594 1.0588 1.0364 1.0613 1.0969 1.0873 1.0955 1.0374 1.0989 1.1027 1.1040 1.1042 1.1034 1.1008 1.0993 1.0988 1.1012 1.0654
irintensity: 0.3690 0.5594 0.8821 0.1485 0.6367 0.2663 0.1382 4.4328 17.4852 12.9148 2.1457 21.6258 1.5850 15.4283 6.0793 0.0933 0.0059 19.8149 8.2812 13.6280 13.9950 18.8621 5.5039 29.0654 16.3212 7.1791 1.5804 3.1940 33.7221 190.4664 15.0509 0.4880 5.8000 12.8545 32.8884 2.3284 99.0150 12.3857 4.8469 1.8355 1.4669 19.3375 75.4827 20.1967 15.1531 7.5078 33.0212 1.2079 0.0455 11.9231 110.2215 7.9168 28.1121 3.8428 2.3583 9.2278 1.7157 0.5724 2.0950 0.9495 0.4192 1.4996 0.4027 0.2812 2.6952 1.6517 17.7449 4.6085 5.2346 4.2888 19.3015 11.2000 1.7373 9.6727 1.0248 0.1424 0.8291 0.1775 7.8508 9.8746 5.0753 3.4101 29.4953 0.0598 0.6440 6.1075 2.5366 9.3541 146.5412 37.8530 58.5255 0.2977 8.7810 2.7042 12.1919 3.0686 1.6156 2.5281 70.6545 119.1477 99.6895 53.8575 17.3686 23.8480 63.1701
temp: 298.150 k
press: 1.00000 atm
elementType: 16 8 8 8 8 6 6 6 6 6 6 6 6 6 6 1 1 1 1 1 1 1 1 1 1 1 1 1 1 1 1 1 1 1 1 1 1
symmnumber: 1
zpe: 814885.8 jmol-1
zpe.correction: 0.310374 hartree
zpe.thermalcorrener: 0.331213 hartree
zpe.thermalcorrenthalpy: 0.332158 hartree
zpe.thermalcorrgfe: 0.256913 hartree
zpe.sumelectzpe: -1091.766367 hartree
zpe.sumelectthermal: -1091.745528 hartree
zpe.sumelectthermalent: -1091.744583 hartree
zpe.sumelectthermalfe: -1091.819828 hartree
dipole: -2.5171 4.6079 0.0406
dipole: 5.2507
quadrupole: -111.6565 -102.8173 -106.6197
quadrupole: 17.4750 0.5992 -0.7663
quadrupole: -4.6254 4.2139 0.4114 17.4750 0.5992 -0.7663
hfenergy: -1092.0767411 hartree
pointgroup: C01 [X(C10H22O4S1)]
dipole: -0.9449109 -1.8369942 0.0110544 debye
polarizability: 189.8704678|6.4330726|147.8623512|3.2889329|2.2825964|123.0251323 unknown
InChI: InChI=1S/C10H22O4S/c1-3-4-5-6-7-8-9-10(2)14-15(11,12)13/h10-11H,3-9H2,1-2H3
charge 0 multiplicity 1
37 atoms
S  4.212945 1.11007 -0.029569
O  3.729325 -0.597345 0.512132
O  5.957039 0.764677 0.349343
O  3.958653 1.245168 -1.610663
O  3.737935 2.269494 0.963794
C  -1.299964 0.030845 0.361269
C  -0.109033 -0.832638 -0.113126
C  -2.656809 -0.451649 -0.198651
C  1.238373 -0.362633 0.485009
C  -3.851349 0.410016 0.269237
C  2.449877 -1.11423 -0.091973
C  -5.210304 -0.081529 -0.278499
C  -6.406456 0.779061 0.188735
C  2.510774 -2.609496 0.255825
C  -7.760309 0.276252 -0.357794
H  -1.131136 1.085205 0.059824
H  -1.338188 0.026628 1.470429
H  -0.298402 -1.889333 0.163189
H  -0.055422 -0.798619 -1.221516
H  -2.6175 -0.45098 -1.308113
H  -2.825724 -1.505923 0.106016
H  1.231816 -0.481018 1.585883
H  1.35329 0.722047 0.282252
H  -3.885553 0.417664 1.378891
H  -3.689078 1.462657 -0.043506
H  2.509702 -0.969645 -1.190175
H  -5.374071 -1.134008 0.035185
H  -5.178204 -0.089962 -1.388272
H  -6.435322 0.790425 1.297564
H  -6.245204 1.829625 -0.128256
H  2.471628 -2.756614 1.348711
H  3.435013 -3.067846 -0.133948
H  1.648865 -3.12636 -0.201919
H  -7.959112 -0.761528 -0.029298
H  -8.598465 0.907363 -0.009237
H  -7.768552 0.284271 -1.46423
H  6.024719 -0.235612 0.387454
