program: Gaussian 09
title: 000171562
version: EM64L-G09RevD.01
frameworkgroup: C1[X(C12H10NO5P)]
method: RPBEPBE
basis: SDD
operation: Freq
keyword: #p
keyword: freq=noraman
keyword: PBEPBE/SDD
title: #p freq=noraman PBEPBE/SDD
converged: YES YES NO NO
title: Mulliken charges:
elementType: P O O O O O N C C C C C C C C C C C C H H H H H H H H H H
charge: 1.240518 -0.519474 -0.660681 -0.599674 -0.213794 -0.216265 0.021276 -0.155882 0.349621 -0.288591 -0.238299 -0.302786 -0.341778 0.382205 -0.199717 -0.208095 -0.341450 -0.332416 -0.213584 0.281125 0.274094 0.312486 0.263901 0.243949 0.242614 0.287676 0.289218 0.241240 0.402565
chargesum: 0.00000
title: Mulliken charges with hydrogens summed into heavy atoms:
elementType: P O O O O O N C C C C C C C C C C C C
charge: 1.240518 -0.519474 -0.258116 -0.599674 -0.213794 -0.216265 0.021276 -0.155882 0.349621 -0.007466 0.035795 0.009700 -0.077877 0.382205 0.044232 0.034519 -0.053774 -0.043198 0.027656
polarizability: 2.39113411e+02 -1.99798767e+00 1.42357306e+02 -1.48219157e+01 -3.93581037e+00 1.69300504e+02
1716.lowfreq: -4.5868 -0.0015 -0.0009 -0.0002 4.9596 9.6636 14.5124 19.9904 27.4251
frequency: 14.4623 19.9385 27.3989 70.7823 71.6034 100.9704 127.5721 133.8679 178.8423 197.6974 210.1903 252.7894 272.2097 295.4193 309.5563 345.3629 379.7012 396.6694 409.5149 416.0344 453.5488 486.3741 498.6847 511.3510 558.7566 609.6674 624.8331 656.5480 666.7493 685.3039 698.0112 731.1400 734.9635 766.0323 776.0032 832.9506 837.7731 860.1194 870.4584 939.2348 982.9839 985.9152 986.8258 995.3024 999.2094 1010.0779 1013.9266 1024.3685 1037.1842 1085.4908 1093.5626 1104.7102 1108.2538 1167.3882 1178.9187 1192.3448 1206.1959 1223.9241 1292.9514 1317.3141 1356.3298 1385.0846 1396.7084 1429.1322 1431.2301 1468.0462 1473.3510 1588.8997 1589.8221 1596.1437 1603.3105 3137.9138 3146.2567 3155.9135 3161.2828 3166.8882 3169.8189 3176.8411 3184.1785 3189.7818 3601.1743
redmass: 7.7363 4.9889 4.1244 7.3928 7.7450 8.7181 7.3146 5.9648 2.5636 9.8499 6.4390 6.8668 6.5213 2.6223 5.3358 3.9781 6.2863 2.8145 8.2955 3.0280 7.2360 4.0608 4.0139 6.1557 7.9342 6.4820 7.5050 9.2652 4.8386 7.1954 2.1410 6.4964 4.8552 1.6871 8.8916 5.6348 1.3384 1.2498 1.5669 1.3575 1.3362 5.6625 1.3884 1.3626 2.9025 1.3427 1.9842 1.9657 3.6962 1.6942 3.1298 2.2874 1.4694 1.5389 1.0559 1.1525 2.9436 6.1217 1.2854 1.3036 7.8757 9.1632 10.0526 4.0010 2.1489 2.0349 2.3715 7.7256 6.2181 5.7941 6.5305 1.0860 1.0893 1.0929 1.0914 1.0970 1.0890 1.1014 1.0955 1.0974 1.0661
irintensity: 0.6316 0.1806 0.1897 0.6237 1.0159 1.9482 0.8958 2.1815 41.1866 1.0410 3.5236 21.2357 3.6608 42.4748 4.5188 39.0402 84.1088 0.2110 27.8739 0.3065 63.5522 6.5437 33.7611 74.4188 58.5050 0.6452 20.4794 70.8942 20.1064 105.9381 98.3886 262.9227 9.1417 17.0183 16.3134 209.1563 15.1596 0.7533 84.7645 0.8552 0.9722 9.3043 0.0455 0.7319 8.9526 1.2768 60.9892 51.6091 68.2558 2.9384 26.1434 101.3038 12.1988 302.2347 0.3676 20.4413 212.3399 339.9415 0.2158 4.2669 85.9921 1.1270 30.9136 30.4064 18.3266 5.7937 114.6710 43.9076 1.9259 2.4733 195.9775 0.6017 3.6299 6.3732 4.4770 9.9836 1.0732 16.7756 0.8967 2.8333 88.5130
temp: 298.150 k
press: 1.00000 atm
elementType: 15 8 8 8 8 8 7 6 6 6 6 6 6 6 6 6 6 6 6 1 1 1 1 1 1 1 1 1 1
symmnumber: 1
zpe: 529012.9 jmol-1
zpe.correction: 0.201490 hartree
zpe.thermalcorrener: 0.218959 hartree
zpe.thermalcorrenthalpy: 0.219903 hartree
zpe.thermalcorrgfe: 0.152882 hartree
zpe.sumelectzpe: -1233.933924 hartree
zpe.sumelectthermal: -1233.916456 hartree
zpe.sumelectthermalent: -1233.915512 hartree
zpe.sumelectthermalfe: -1233.982533 hartree
dipole: 7.0731 0.7360 -2.4165
dipole: 7.5107
quadrupole: -145.2646 -108.4558 -112.3744
quadrupole: 19.2651 -0.0094 5.8430
quadrupole: -23.2330 13.5758 9.6572 19.2651 -0.0094 5.8430
hfenergy: -1234.1354146 hartree
pointgroup: C01 [X(C12H10N1O5P1)]
dipole: 2.6970537 -0.4387735 1.1247025 debye
polarizability: 237.2167154|-5.6515413|141.9836558|17.9101709|-2.0876666|171.5708502 unknown
InChI: InChI=1S/C12H10NO5P/c14-13(15)10-6-8-11(9-7-10)18-19(16,17)12-4-2-1-3-5-12/h1-9,16H
charge 0 multiplicity 1
29 atoms
P  1.935632 1.290435 -0.354342
O  0.501545 1.383099 0.705895
O  2.889815 2.381062 0.561469
O  1.635198 1.627192 -1.879551
O  -5.256452 -0.177201 -1.618925
O  -5.588905 -0.45652 0.621811
N  -4.846125 -0.152827 -0.392834
C  2.750681 -0.315288 -0.010133
C  -0.801182 0.988622 0.350331
C  2.853906 -1.23563 -1.079474
C  3.246853 -0.618081 1.279161
C  -1.282641 0.96903 -0.985375
C  -1.643487 0.645867 1.43864
C  -3.446863 0.243752 -0.134835
C  3.462381 -2.488492 -0.846994
C  3.855175 -1.872898 1.496966
C  -2.615341 0.586897 -1.224072
C  -2.975827 0.274099 1.19864
C  3.95944 -2.806759 0.438213
H  2.47472 -0.967729 -2.071767
H  3.170219 0.115505 2.087347
H  -0.625161 1.257446 -1.810724
H  -1.23508 0.677732 2.452344
H  3.54971 -3.209857 -1.665765
H  4.247562 -2.120948 2.488467
H  -3.022783 0.55874 -2.238051
H  -3.651228 0.003533 2.01414
H  4.430968 -3.779679 0.614418
H  2.54677 3.309498 0.602701
