program: Gaussian 09
title: 000171767
version: EM64L-G09RevD.01
frameworkgroup: C1[X(C18H14N2O8S4)]
method: RPBEPBE
basis: SDD
operation: Freq
keyword: #p
keyword: freq=noraman
keyword: PBEPBE/SDD
title: #p freq=noraman PBEPBE/SDD
converged: YES YES NO NO
title: Mulliken charges:
elementType: S S S S O O O O O O O O N N C C C C C C C C C C C C C C C C C C H H H H H H H H H H H H H H
charge: 0.284250 0.284244 0.994799 0.994796 -0.268951 -0.268951 -0.578605 -0.578591 -0.506848 -0.468902 -0.506848 -0.468909 0.042910 0.042899 0.426628 0.426646 -0.317314 -0.317316 0.268402 0.268388 -0.232362 -0.232360 -0.243314 -0.243319 -0.334891 -0.334891 -0.243045 -0.243034 -0.246189 -0.246195 -0.521255 -0.521237 0.246303 0.246299 0.306122 0.306128 0.251779 0.251780 0.240316 0.260011 0.256883 0.240320 0.259975 0.256897 0.383277 0.383276
chargesum: 0.00000
title: Mulliken charges with hydrogens summed into heavy atoms:
elementType: S S S S O O O O O O O O N N C C C C C C C C C C C C C C C C C C
charge: 0.284250 0.284244 0.994799 0.994796 -0.268951 -0.268951 -0.195327 -0.195315 -0.506848 -0.468902 -0.506848 -0.468909 0.042910 0.042899 0.426628 0.426646 -0.317314 -0.317316 0.268402 0.268388 -0.232362 -0.232360 -0.243314 -0.243319 -0.088587 -0.088593 0.063078 0.063094 0.005590 0.005585 0.235955 0.235955
polarizability: 6.79778399e+02 4.49938293e+01 3.32412552e+02 -2.43970064e-04 1.90524801e-03 1.85225689e+02
1716.lowfreq: -2.8106 0.0012 0.0020 0.0022 1.2094 3.0552 9.2667 16.3691 25.6702
frequency: 9.2582 16.3553 25.6281 29.6340 41.0082 44.0258 47.7008 56.9195 74.6836 98.7228 110.7607 127.8666 134.1315 136.0043 142.4838 142.8888 149.3306 162.1668 164.8742 175.7836 183.2767 192.7074 202.3835 206.5328 216.2604 219.2410 233.1125 236.5057 240.3739 255.6808 262.6503 267.9449 303.5541 309.4164 309.9489 320.6589 321.2440 340.7842 361.0638 383.7841 413.6352 416.0384 441.9139 442.9776 474.1234 488.2667 492.4048 506.6019 509.2852 526.3477 537.6285 544.7763 566.5799 567.5979 591.1306 602.4045 623.6341 624.5461 645.7896 663.2710 676.1441 743.1553 745.1652 766.6909 767.2065 777.6656 808.9950 809.8308 832.2166 839.2632 847.7365 907.6803 932.8416 933.6713 937.8461 938.4863 957.1754 967.0687 967.7470 991.4650 991.4920 1049.7318 1049.7886 1083.9643 1084.0963 1107.7269 1108.9578 1117.0430 1121.1399 1154.3122 1154.4827 1171.1154 1179.3748 1206.4205 1211.1719 1225.0130 1229.8798 1281.6743 1338.3405 1340.7312 1351.0464 1379.5817 1394.5098 1396.3932 1426.1789 1427.7634 1446.9891 1449.3070 1466.4172 1466.4876 1473.9047 1473.9793 1493.7502 1508.8001 1542.4750 1542.9598 1596.4886 1597.1604 2998.9081 2998.9554 3116.1530 3116.1766 3137.3223 3137.3961 3143.4146 3143.4286 3156.0870 3156.1625 3177.2428 3177.2466 3480.8356 3480.8458
redmass: 6.4771 8.6371 8.3058 10.9428 8.1352 6.7451 8.0941 8.0343 11.2753 6.8944 5.3127 5.1154 1.7732 1.7583 2.4774 2.3398 3.4611 2.1636 2.9562 2.0044 2.7736 3.8798 6.6397 5.7209 6.1424 5.2751 5.0590 4.0933 3.6669 7.7504 5.9736 6.9503 7.3645 6.8201 7.0903 8.6292 8.6455 8.8809 7.0320 7.2379 10.3903 10.7309 10.7866 26.2445 7.8078 8.6282 8.7537 7.4829 7.5035 7.2572 10.1309 7.8305 4.3144 4.0115 8.0544 8.9464 9.9995 9.7323 8.6171 8.7237 12.3116 4.9953 4.6995 2.9036 2.8675 9.9670 1.9676 1.8925 9.6944 12.5510 11.3849 9.4702 9.0956 7.6589 1.3882 1.4130 9.4906 16.1392 16.4573 1.3577 1.3549 1.1726 1.1722 2.1407 2.1791 1.6613 1.3928 2.1927 2.5088 1.3182 1.3191 1.5720 1.4571 2.1233 2.9426 2.3240 2.2448 7.7524 5.4033 7.0577 7.6874 5.1106 1.9225 2.2699 1.8230 1.7354 1.9569 1.9981 1.1135 1.1246 1.0532 1.0540 7.5286 8.9745 6.2651 6.2965 6.7256 6.7683 1.0285 1.0285 1.1062 1.1062 1.0894 1.0894 1.1045 1.1045 1.0905 1.0905 1.0987 1.0987 1.0661 1.0661
irintensity: 0.0482 0.1417 0.2875 0.1802 0.4931 0.0300 5.5357 1.5946 0.3689 2.3080 0.1324 11.3846 20.2676 8.7622 43.4339 0.4434 12.7931 35.5721 2.9000 13.6478 13.4136 0.1033 0.7626 26.3779 1.7595 0.1623 12.6189 8.8207 18.0207 8.1806 7.2469 2.1144 31.6440 19.2856 63.0128 9.0280 6.6138 0.0013 4.8149 2.4261 202.7266 25.4252 9.8529 0.1614 3.4939 11.1724 0.0902 3.7435 5.3735 12.4718 232.1926 54.1760 7.1163 13.4743 10.7357 0.0853 26.8376 2.5417 3.3713 26.4593 0.1028 2.2579 16.9758 53.8486 0.2385 9.8329 32.3275 61.0465 41.2555 56.4483 91.6151 0.4295 112.6313 1.9883 1.2251 0.1747 87.1378 54.1288 73.6015 0.0376 1.8171 51.4271 114.5195 3.4120 36.0654 8.9317 0.0273 4.4568 4.9931 15.2910 0.7934 0.6987 0.9761 23.8802 0.0727 78.6548 1.0003 0.2080 25.0424 2.9621 77.9923 4.1755 22.9631 16.4429 4.7532 7.4128 0.6470 177.7139 9.6438 33.2132 17.6715 0.9473 1.5573 47.0882 0.0354 24.1920 0.5328 8.9337 73.2817 12.5649 3.4148 5.3180 17.3236 0.7910 3.5185 15.6893 39.8673 0.0485 8.5233 7.1240 78.6559 12.7265
temp: 298.150 k
press: 1.00000 atm
elementType: 16 16 16 16 8 8 8 8 8 8 8 8 7 7 6 6 6 6 6 6 6 6 6 6 6 6 6 6 6 6 6 6 1 1 1 1 1 1 1 1 1 1 1 1 1 1
symmnumber: 1
zpe: 772459.7 jmol-1
zpe.correction: 0.294214 hartree
zpe.thermalcorrener: 0.327357 hartree
zpe.thermalcorrenthalpy: 0.328301 hartree
zpe.thermalcorrgfe: 0.226325 hartree
zpe.sumelectzpe: -2995.124116 hartree
zpe.sumelectthermal: -2995.090974 hartree
zpe.sumelectthermalent: -2995.090030 hartree
zpe.sumelectthermalfe: -2995.192005 hartree
dipole: 0.0006 0.0004 -7.3701
dipole: 7.3701
quadrupole: -263.7534 -181.4261 -232.4130
quadrupole: 1.3860 -0.0006 0.0013
quadrupole: -37.8892 44.4381 -6.5488 1.3860 -0.0006 0.0013
hfenergy: -2995.4183304 hartree
pointgroup: C01 [X(C18H14N2O8S4)]
dipole: -0.0002857 -2.8996387 0.0001205 debye
polarizability: 685.3616343|-0.0025831|185.2256889|-7.3380544|0.0012378|326.8293171 unknown
InChI: InChI=1S/C18H14N2O8S4/c1-27-13-9(5-3-7-11(13)31(21,22)23)15-19-17-18(29-15)20-16(30-17)10-6-4-8-12(14(10)28-2)32(24,25)26/h3-8,21,24H,1-2H3
charge 0 multiplicity 1
46 atoms
S  -1.110898 -0.280162 1.828421
S  1.1109 -0.280357 -1.828323
S  -7.262066 1.129799 -1.171218
S  7.262186 1.129752 1.171026
O  -4.21415 0.899735 -1.580361
O  4.214264 0.899586 1.580435
O  -7.189278 -0.205801 -2.477515
O  7.18972 -0.205837 2.477352
O  -8.692433 1.024688 -0.417998
O  -6.842456 2.535252 -1.836543
O  8.692453 1.02476 0.417602
O  6.842556 2.535179 1.8364
N  -1.604579 -0.298003 -0.839937
N  1.60458 -0.297989 0.840036
C  -3.698238 -0.286033 0.548126
C  3.698243 -0.286174 -0.548037
C  -2.250645 -0.299216 0.325047
C  2.250651 -0.299294 -0.324945
C  -4.614395 0.283184 -0.408484
C  4.614455 0.283009 0.408545
C  0.246526 -0.291156 0.660482
C  -0.246524 -0.291199 -0.660383
C  -5.978792 0.331659 -0.033077
C  5.97883 0.331522 0.033036
C  -4.220622 -0.789726 1.774279
C  4.220562 -0.78986 -1.77422
C  -6.496942 -0.158362 1.173955
C  6.496906 -0.158467 -1.174039
C  -5.589774 -0.734343 2.089214
C  5.589692 -0.734468 -2.089238
C  -3.983694 0.065904 -2.797026
C  3.983636 0.065751 2.797072
H  -3.529614 -1.245202 2.492829
H  3.529513 -1.245314 -2.492745
H  -7.570349 -0.087892 1.376959
H  7.570297 -0.087964 -1.377119
H  -5.952878 -1.136844 3.038855
H  5.952739 -1.136948 -3.03891
H  -3.746624 0.80007 -3.580227
H  -4.912716 -0.476507 -3.041784
H  -3.128441 -0.606033 -2.626134
H  3.746648 0.799932 3.580284
H  4.912566 -0.476803 3.041852
H  3.128286 -0.606049 2.626135
H  -7.854277 0.039442 -3.184725
H  7.854677 0.039576 3.184543
