program: Gaussian 09
title: 000171530
version: EM64L-G09RevD.01
frameworkgroup: C1[X(C10H18O)]
method: RPBEPBE
basis: SDD
operation: Freq
keyword: #pfreq=noraman
keyword: PBEPBE/SDD
title: #p freq=noraman PBEPBE/SDD
converged: YES YES NO NO
title: Mulliken charges:
elementType: O C C C C C C C C C C H H H H H H H H H H H H H H H H H H
charge: -0.219977 -0.371827 -0.367236 -0.352071 -0.385463 -0.356480 -0.511434 -0.696299 0.193815 -0.184843 -0.503664 0.192081 0.192023 0.186076 0.186185 0.186388 0.186431 0.217773 0.217429 0.195744 0.195739 0.233664 0.234003 0.209281 0.209301 0.215845 0.246938 0.222537 0.228043
chargesum: 0.00000
title: Mulliken charges with hydrogens summed into heavy atoms:
elementType: O C C C C C C C C C C
charge: -0.219977 0.012276 0.005024 0.020748 0.049739 0.035003 -0.043767 -0.061872 0.193815 0.062094 -0.053085
polarizability: 1.39141056e+02 8.71407128e+00 1.15471098e+02 3.19132865e-02 1.93045462e-02 7.76622477e+01
1716.lowfreq: -0.0006 -0.0004 0.0006 4.2941 9.0238 18.7570 37.8822 53.4342 54.8857
frequency: 37.2324 49.6756 53.4109 83.9450 94.5263 128.8486 136.0830 139.1180 146.4002 191.2767 225.2997 254.7438 324.6160 410.2430 412.8248 450.1268 530.7149 554.8671 650.7981 723.3469 731.6704 769.5063 812.4515 835.9009 888.2556 913.3748 962.6723 973.0152 996.7150 1004.9241 1018.3935 1034.9138 1059.9136 1080.9240 1085.7280 1098.9884 1119.6996 1186.8679 1188.6218 1228.8345 1231.7624 1270.4691 1275.3985 1277.5301 1282.2869 1295.1162 1297.6086 1316.7103 1346.4563 1356.8575 1361.3742 1389.0723 1422.2020 1435.8422 1462.3753 1464.3404 1468.8829 1476.0224 1476.4690 1483.7487 1489.9098 1581.0151 1634.7900 2949.5857 2952.6422 2960.9330 2961.7549 2970.2499 2972.2907 2986.4437 2995.3913 2996.2120 3006.4414 3016.4065 3035.8683 3059.8529 3068.8631 3071.1860 3100.5791 3126.7398 3205.7262
redmass: 3.4292 2.0151 3.8960 1.9186 2.0946 2.4496 3.7005 1.8498 2.0947 4.5832 1.1341 3.5870 3.2485 1.6562 3.4031 3.0195 4.3366 3.4209 1.4163 1.0700 1.1148 1.2216 4.6028 1.3252 1.8756 1.3130 1.8132 1.3279 1.2001 3.3262 1.1388 3.0901 2.7811 2.1151 2.3333 1.4055 2.6629 1.8118 1.7249 1.3837 1.4369 1.2246 1.4570 1.2894 1.0343 1.0807 1.1248 1.5212 1.5985 1.6689 1.7158 1.2177 1.2355 1.1138 1.0725 1.0692 1.0746 1.0732 1.0425 1.0838 1.0943 7.3889 4.2357 1.0589 1.0587 1.0596 1.0595 1.0580 1.0374 1.0970 1.0999 1.0602 1.0975 1.1033 1.1045 1.1034 1.1007 1.0992 1.0595 1.0949 1.1144
irintensity: 0.1988 0.9543 1.3087 0.4659 0.0632 1.3813 1.7092 0.2044 0.0859 1.3232 0.0003 1.0191 5.3081 2.2785 3.1229 0.2132 6.8484 1.3369 0.8432 16.3143 0.0007 7.1774 0.1696 1.1398 3.0518 5.8744 43.8318 62.6984 0.2642 4.8168 19.8904 1.4449 0.0481 0.2969 0.3273 0.4443 7.7060 19.5014 0.1858 0.0223 32.9228 0.1390 11.9944 12.3308 0.0314 0.4940 0.0686 22.0034 20.3775 0.9681 10.0326 11.7330 31.7632 11.4488 0.3493 0.2849 2.1123 2.1489 12.3948 2.8732 24.9848 101.4698 10.1996 5.3584 3.2611 8.3769 33.8815 115.0794 31.1704 2.5783 2.2909 31.0464 6.7551 0.1982 64.1364 73.9108 107.2826 54.5465 6.3220 8.6804 22.2304
temp: 298.150 k
press: 1.00000 atm
elementType: 8 6 6 6 6 6 6 6 6 6 6 1 1 1 1 1 1 1 1 1 1 1 1 1 1 1 1 1 1
symmnumber: 1
zpe: 670643.7 jmol-1
zpe.correction: 0.255435 hartree
zpe.thermalcorrener: 0.269451 hartree
zpe.thermalcorrenthalpy: 0.270395 hartree
zpe.thermalcorrgfe: 0.213202 hartree
zpe.sumelectzpe: -466.167888 hartree
zpe.sumelectthermal: -466.153872 hartree
zpe.sumelectthermalent: -466.152928 hartree
zpe.sumelectthermalfe: -466.210122 hartree
dipole: -0.0574 -3.3118 -0.0007
dipole: 3.3123
quadrupole: -65.4088 -73.8178 -69.5881
quadrupole: 12.1229 0.0090 0.0087
quadrupole: 4.1961 -4.2129 0.0168 12.1229 0.0090 0.0087
hfenergy: -466.4233232 hartree
pointgroup: C01 [X(C10H18O1)]
dipole: -0.0183672 -1.3027923 -0.0249753 debye
polarizability: 139.0841429|8.7901113|115.5140298|0.1217794|0.727097|77.6762293 unknown
InChI: InChI=1S/C10H18O/c1-3-5-6-7-8-9-10(11)4-2/h4H,2-3,5-9H2,1H3
charge 0 multiplicity 1
29 atoms
O  -2.988416 1.732725 0.044834
C  2.121223 0.428551 0.010612
C  0.82015 -0.405532 0.0020
C  3.402739 -0.434699 -0.0030
C  -0.453703 0.467541 0.016911
C  4.703173 0.401316 0.004837
C  -1.743954 -0.374077 0.005165
C  5.978901 -0.46841 -0.008973
C  -3.02474 0.465511 0.020585
C  -4.355435 -0.216347 0.007126
C  -4.556862 -1.562426 -0.019993
H  2.129662 1.083521 0.906746
H  2.126482 1.106594 -0.868206
H  0.813331 -1.059775 -0.895549
H  0.817167 -1.084276 0.881173
H  3.395918 -1.090009 -0.899404
H  3.399606 -1.112379 0.876619
H  -0.452899 1.122292 0.909206
H  -0.454891 1.149454 -0.854803
H  4.70909 1.055755 0.90039
H  4.705379 1.07833 -0.873762
H  -1.764504 -1.031242 -0.889404
H  -1.762313 -1.059715 0.87815
H  6.011022 -1.109764 -0.910106
H  6.014953 -1.132363 0.875466
H  6.89386 0.152226 -0.00315
H  -5.207541 0.476842 0.02104
H  -5.567208 -1.986415 -0.028586
H  -3.726393 -2.277927 -0.034326
