program: Gaussian 09
title: 000171557
version: EM64L-G09RevD.01
frameworkgroup: C1[X(C12H16BrNO3)]
method: RPBEPBE
basis: SDD
operation: Freq
keyword: #p
keyword: freq=noraman
keyword: PBEPBE/SDD
title: #p freq=noraman PBEPBE/SDD
converged: YES YES NO NO
title: Mulliken charges:
elementType: Br O O O N C C C C C C C C C C C C H H H H H H H H H H H H H H H H
charge: -0.057777 -0.285984 -0.285771 -0.264835 -0.345714 -0.554900 0.515664 -0.371632 -0.552584 -0.422327 0.242139 0.180160 -0.328927 0.286086 -0.734996 -0.540580 -0.519006 0.218986 0.221160 0.259319 0.232088 0.260626 0.236024 0.252021 0.337235 0.310810 0.307528 0.236589 0.226609 0.243639 0.209893 0.258587 0.229871
chargesum: 0.00000
title: Mulliken charges with hydrogens summed into heavy atoms:
elementType: Br O O O N C C C C C C C C C C C C
charge: -0.057777 -0.285984 -0.285771 -0.264835 -0.008479 -0.114754 0.515664 0.119775 -0.291958 -0.186303 0.242139 0.180160 -0.076906 0.286086 -0.116659 0.166257 0.179345
polarizability: 1.91315545e+02 -2.77304736e+01 1.89850841e+02 -2.55249877e+01 -8.44929188e+00 1.13034748e+02
1716.lowfreq: -5.6575 -2.9736 0.0006 0.0006 0.0008 8.3347 18.1251 22.4064 31.0727
frequency: 17.9996 22.0256 30.9624 54.5645 62.7656 77.2282 91.0875 102.3153 120.5886 166.4600 172.6526 195.0008 211.6557 233.0023 272.2549 277.4310 300.7463 337.2027 349.2627 381.6021 431.4629 462.0447 483.7908 529.7528 542.9794 558.1263 587.2542 618.5646 640.1047 664.9980 687.1508 719.5556 736.2622 807.8002 828.8326 862.9134 870.3279 886.3335 920.6579 943.2329 959.4833 982.0189 1009.8192 1036.4216 1090.8833 1110.8349 1111.8784 1113.2834 1140.3734 1148.2764 1155.5253 1161.2277 1189.0358 1214.0107 1218.9936 1231.2708 1260.8554 1265.7494 1274.5538 1319.2286 1353.8872 1378.5573 1403.5781 1413.0722 1427.8785 1445.4361 1455.5906 1464.4534 1468.0459 1468.1736 1475.3570 1481.1580 1499.6336 1507.9170 1582.1503 1604.4714 1609.4430 2962.6349 2974.0231 2995.3481 2996.2859 3053.4795 3057.3150 3068.9963 3079.0994 3083.4211 3124.5068 3127.2566 3129.0643 3144.7483 3152.8339 3165.4968 3495.2045
redmass: 6.5153 7.2772 6.0238 3.6719 3.9245 2.8904 2.7831 3.1712 3.3363 2.0724 2.4858 3.2437 2.4173 3.7669 1.6288 3.3616 3.3877 6.4105 3.9019 2.6437 4.4301 3.4379 3.5236 4.6587 4.6937 3.1646 4.3952 5.0247 3.2530 1.1639 4.7275 4.9192 3.3736 2.0184 1.5379 1.6053 1.7222 3.9576 2.8745 1.3709 7.9471 4.1286 2.7957 1.9906 4.6531 1.2686 2.0028 1.2565 1.1423 1.5163 1.3962 1.6858 1.2161 1.8921 1.3004 1.2741 2.4958 1.7601 1.8175 1.4009 1.3764 5.5585 2.2571 1.0972 1.2063 1.3151 1.0711 1.0944 1.1116 1.0509 1.1196 1.0546 2.3676 2.1369 7.5334 8.0869 6.5730 1.0327 1.0352 1.0647 1.0601 1.1043 1.1011 1.0568 1.1005 1.0965 1.0998 1.1046 1.0894 1.0900 1.1087 1.0952 1.0776
irintensity: 0.6291 1.7448 2.1644 1.8649 8.9832 0.9003 6.5257 10.6099 4.2433 5.3289 3.4801 1.1559 1.0298 6.7541 0.9984 1.6792 3.8137 9.0808 3.9262 8.9083 11.0706 1.2369 2.2207 5.9032 1.7531 4.2038 2.3882 79.3009 13.4775 129.1570 5.8372 6.5145 7.4290 6.1114 30.8871 24.8179 5.7663 13.3768 0.2718 1.7695 37.8187 11.3399 35.8087 17.6172 10.9884 4.0663 85.2846 0.3437 2.7559 15.3385 9.0910 26.5350 6.0875 68.4049 0.5444 33.9598 84.8745 99.5142 32.6944 18.6178 27.0963 11.5526 22.4433 32.4383 1.3668 12.6291 7.7844 19.9028 14.8420 13.2946 59.4781 30.4102 127.2628 209.0214 16.0428 198.9894 85.2575 51.5702 81.1739 25.5343 31.4311 35.5789 23.3762 2.4852 8.2255 39.7305 22.4302 19.7078 9.9451 10.8005 0.0776 6.8755 45.4517
temp: 298.150 k
press: 1.00000 atm
elementType: 35 8 8 8 7 6 6 6 6 6 6 6 6 6 6 6 6 1 1 1 1 1 1 1 1 1 1 1 1 1 1 1 1
symmnumber: 1
zpe: 687261.8 jmol-1
zpe.correction: 0.261764 hartree
zpe.thermalcorrener: 0.280311 hartree
zpe.thermalcorrenthalpy: 0.281256 hartree
zpe.thermalcorrgfe: 0.211296 hartree
zpe.sumelectzpe: -759.447839 hartree
zpe.sumelectthermal: -759.429292 hartree
zpe.sumelectthermalent: -759.428348 hartree
zpe.sumelectthermalfe: -759.498307 hartree
dipole: 0.3577 -1.3138 0.1655
dipole: 1.3717
quadrupole: -132.5789 -104.1149 -104.8243
quadrupole: 2.6014 -1.9624 -5.0197
quadrupole: -18.7396 9.7245 9.0151 2.6014 -1.9624 -5.0197
hfenergy: -759.7096036 hartree
pointgroup: C01 [X(C12H16Br1N1O3)]
dipole: -0.1980534 -0.5008554 0.0338185 debye
polarizability: 196.283756|21.7221957|185.2703214|-30.8408603|-2.986145|112.6470564 unknown
InChI: InChI=1S/C12H16BrNO3/c1-16-10-4-3-9(7-11(10)17-2)5-6-14-12(15)8-13/h3-4,7,14H,5-6,8H2,1-2H3
charge 0 multiplicity 1
33 atoms
Br 2.26898 -2.568205 1.057521
O  -2.287617 -1.802289 -0.576453
O  -4.029113 -0.148835 0.963359
O  4.639073 0.646607 -0.331316
N  2.400277 0.552644 0.347164
C  0.931709 2.053278 -1.034635
C  -0.380616 1.460665 -0.539026
C  2.076937 1.949414 0.012675
C  -0.700607 0.102328 -0.799007
C  -1.287291 2.235635 0.223054
C  -1.894279 -0.480025 -0.309647
C  -2.788632 0.30448 0.48495
C  -2.471064 1.65744 0.729818
C  3.638444 0.012601 0.135866
C  3.88973 -1.45474 0.494086
C  -1.417053 -2.612951 -1.434313
C  -4.063856 -1.424101 1.70934
H  0.797804 3.126145 -1.270261
H  1.262447 1.552617 -1.963486
H  3.002306 2.407402 -0.377166
H  1.783533 2.486873 0.934941
H  -0.017589 -0.491823 -1.41531
H  -1.070982 3.291548 0.423033
H  -3.183498 2.241525 1.320803
H  1.652826 -0.045489 0.713258
H  4.586795 -1.517003 1.343541
H  4.312103 -1.974825 -0.377655
H  -0.418131 -2.753288 -0.977636
H  -1.310697 -2.157835 -2.437734
H  -1.926401 -3.5840 -1.520656
H  -3.395876 -1.372909 2.591337
H  -3.772201 -2.268626 1.064942
H  -5.10896 -1.527259 2.038915
