program: Gaussian 09
title: 000171684
version: EM64L-G09RevD.01
frameworkgroup: C1[X(C20H32N2O3)]
method: RPBEPBE
basis: SDD
operation: Freq
keyword: #p
keyword: freq=noraman
keyword: PBEPBE/SDD
title: #p freq=noraman PBEPBE/SDD
converged: YES YES NO NO
title: Mulliken charges:
elementType: O O O N N C C C C C C C C C C C C C C C C C C C C H H H H H H H H H H H H H H H H H H H H H H H H H H H H H H H H
charge: -0.313531 -0.320672 -0.280180 -0.088831 -0.445271 -0.369613 -0.357234 -0.447755 -0.442944 -0.366112 -0.274216 -0.367467 -0.369649 -0.352588 -0.410888 -0.355505 -0.299226 0.246502 -0.695141 0.214989 0.267187 -0.322427 -0.332227 -0.255619 -0.233880 0.225023 0.185209 0.176098 0.228708 0.226296 0.215463 0.205426 0.229841 0.228006 0.189324 0.247979 0.229650 0.192239 0.192761 0.191565 0.192406 0.188271 0.188395 0.215338 0.214570 0.195880 0.195791 0.209966 0.210738 0.210068 0.216955 0.209961 0.362298 0.247979 0.300165 0.223940 0.225990
chargesum: 0.00000
title: Mulliken charges with hydrogens summed into heavy atoms:
elementType: O O O N N C C C C C C C C C C C C C C C C C C C C
charge: -0.313531 -0.320672 -0.280180 -0.088831 -0.082972 0.040620 0.047572 -0.005997 -0.007677 0.051217 0.203413 0.017533 0.014322 0.024077 0.019019 0.036166 0.121478 0.246502 -0.058157 0.214989 0.267187 -0.074448 -0.032062 -0.031679 -0.007890
polarizability: 3.05811614e+02 -1.21089875e+01 2.94087273e+02 -5.01592886e+00 7.19903613e+00 1.55281405e+02
1716.lowfreq: -24.9155 -4.1930 -2.7623 -1.2666 -0.0010 0.0010 0.0017 13.2533 15.3488
frequency: -24.5206 13.0609 15.3307 21.3238 30.1597 38.7379 40.9387 51.9829 63.2752 73.5896 75.9003 83.9254 95.2228 109.4715 123.9307 134.1209 140.7680 149.4828 163.7136 180.9579 196.8397 208.5129 219.2128 235.2102 255.9609 301.8579 303.9625 328.9224 339.3271 365.3545 412.9478 427.1765 455.2554 462.8174 519.9508 558.0354 588.9903 594.4730 607.9869 632.9283 685.1911 705.7722 722.2745 724.0755 736.6973 744.2940 753.7861 769.3147 775.7070 785.7269 804.1869 833.5976 836.2042 843.4663 855.2103 866.0300 890.7087 901.9219 914.6805 918.5233 934.3926 959.8721 967.7347 971.7477 978.2817 1001.2749 1006.7006 1012.6824 1033.1089 1043.8176 1060.4524 1060.9444 1074.6441 1079.9911 1087.2782 1089.3165 1097.4636 1108.5308 1125.6731 1146.0000 1149.2374 1150.5381 1166.1075 1173.6039 1187.4742 1191.3495 1195.5547 1199.3898 1209.4445 1224.3440 1227.7308 1233.2385 1244.1351 1255.0095 1268.4950 1271.2940 1277.0334 1279.8308 1289.8400 1290.0291 1293.8685 1295.7486 1306.0086 1306.8142 1321.6897 1334.3589 1349.9497 1351.2225 1355.4965 1377.9439 1389.9207 1391.4445 1400.0604 1442.5560 1461.8501 1463.5450 1464.8198 1466.1951 1467.2950 1469.5726 1474.8880 1478.9654 1479.1466 1480.4734 1481.8547 1487.6962 1489.5216 1492.5974 1498.4012 1523.0591 1604.7203 1611.9919 1661.7758 2835.9366 2848.0034 2860.6279 2951.0772 2953.2947 2955.2859 2962.1473 2969.5223 2972.7854 2988.5832 2991.9783 2999.1216 3008.5869 3012.0788 3013.2877 3017.8315 3022.7244 3032.3957 3032.5323 3036.8337 3041.6925 3061.4247 3068.8655 3069.2103 3071.9554 3087.2795 3092.6858 3135.0169 3153.1764 3169.2499 3188.2108 3517.3955
redmass: 2.6522 4.1235 3.7226 4.1274 1.7219 4.0495 1.7994 4.5866 4.3848 4.7884 3.1053 2.9177 1.9300 2.7932 4.1084 2.3228 2.4420 2.2874 4.8360 4.7440 4.1787 4.7206 2.6349 1.1108 4.6475 5.2322 4.6978 2.2743 3.6734 4.5390 3.7934 4.5977 3.2980 3.1212 4.6087 3.8719 4.4713 4.7283 3.9871 3.5840 5.0682 5.8927 1.0657 2.5188 1.0984 1.5882 1.2748 1.5966 1.1304 4.3797 1.1673 3.4133 1.1965 2.5673 1.3508 2.1254 1.8759 2.5892 7.3673 1.1916 1.3427 2.0576 1.5139 7.4834 1.2922 1.1198 4.7383 7.6043 3.1693 2.0612 2.8566 3.0064 2.3445 2.1548 2.1190 2.3207 1.6156 2.1005 2.8873 2.4320 1.8989 1.4453 2.6663 1.0662 1.3255 1.5991 2.6290 1.3439 1.4460 1.5946 1.2881 1.3482 1.2029 1.9808 1.1512 1.2237 1.2822 1.0529 1.2729 1.0865 1.1235 1.2828 1.5686 1.3517 1.3843 1.4175 1.5244 1.4537 1.6490 1.5616 1.5504 1.2173 4.6186 2.4914 1.0750 1.0753 1.0906 1.1643 1.3330 1.2138 1.1379 1.0437 1.0863 1.0822 1.1176 1.0897 1.1005 1.1519 1.0978 2.7128 5.8776 6.4926 9.3230 1.0710 1.0726 1.0694 1.0555 1.0589 1.0585 1.0591 1.0588 1.0365 1.0972 1.0590 1.1002 1.1057 1.0597 1.0576 1.1040 1.0669 1.0870 1.0880 1.1048 1.0863 1.1053 1.1041 1.1007 1.0992 1.1081 1.1055 1.0857 1.0915 1.0969 1.0957 1.0758
irintensity: 0.2625 0.0053 0.0679 0.5852 0.1636 0.2792 0.2369 0.3603 1.9899 0.8301 1.5531 0.2332 0.1214 1.7547 0.0806 0.2061 0.7918 2.5422 1.0806 0.0561 0.3348 2.8714 4.0587 0.0118 17.2833 1.0807 1.7478 7.2483 3.9983 8.3176 9.6247 9.7898 7.8751 0.9253 0.4993 0.9885 9.0733 1.9487 1.5697 0.2220 0.2070 17.8067 13.4753 6.7154 1.3640 5.9518 190.4218 3.8294 0.0428 8.4217 1.5268 6.2487 0.9707 11.5302 0.5638 9.9068 3.1843 9.7440 11.4328 1.0867 6.2456 4.1654 1.9392 86.6742 2.5820 0.5618 41.4085 268.4363 2.6283 25.3956 28.2215 9.8565 82.0561 0.4278 2.5034 13.1796 6.0923 82.9672 6.0375 16.6958 118.5507 0.9021 302.4380 5.3791 4.8694 0.5060 140.5452 7.6707 40.6038 12.3954 8.3475 0.0002 4.9324 128.7257 3.7547 0.2026 4.6533 0.2636 8.1502 0.8637 0.0440 2.9361 30.4115 3.6550 2.2565 1.3584 0.1698 2.0518 0.8865 45.3886 1.5218 9.7495 22.1372 182.4046 0.6044 0.1744 4.2411 18.7640 54.4781 22.0094 19.9493 13.1526 7.4423 5.2471 2.6259 0.9956 41.0270 28.9941 5.5289 570.0881 32.8198 124.5675 243.2079 72.2928 35.8319 190.6902 23.5492 1.7719 7.2097 19.0910 119.2218 37.7814 0.4715 42.2889 1.7205 18.9727 17.5261 38.4595 0.4644 57.4633 59.4068 18.7758 57.1938 27.0892 82.6018 6.1617 105.3789 52.3091 29.0913 72.9212 1.3808 28.6567 16.6350 6.0754 86.1552
temp: 298.150 k
press: 1.00000 atm
elementType: 8 8 8 7 7 6 6 6 6 6 6 6 6 6 6 6 6 6 6 6 6 6 6 6 6 1 1 1 1 1 1 1 1 1 1 1 1 1 1 1 1 1 1 1 1 1 1 1 1 1 1 1 1 1 1 1 1
symmnumber: 1
zpe: 1289627.1 jmol-1
zpe.correction: 0.491193 hartree
zpe.thermalcorrener: 0.518099 hartree
zpe.thermalcorrenthalpy: 0.519043 hartree
zpe.thermalcorrgfe: 0.427826 hartree
zpe.sumelectzpe: -1114.545861 hartree
zpe.sumelectthermal: -1114.518955 hartree
zpe.sumelectthermalent: -1114.518011 hartree
zpe.sumelectthermalfe: -1114.609228 hartree
dipole: -3.1042 -2.9059 0.9164
dipole: 4.3497
quadrupole: -132.7915 -150.7857 -155.0412
quadrupole: -13.9462 4.3410 -0.2849
quadrupole: 13.4146 -4.5796 -8.8351 -13.9462 4.3410 -0.2849
hfenergy: -1115.0370543 hartree
pointgroup: C01 [X(C20H32N2O3)]
dipole: 1.0678191 1.2990943 0.3172507 debye
polarizability: 308.4038659|-9.8925359|290.4806054|8.2107329|-12.5845439|156.2958198 unknown
InChI: InChI=1S/C20H32N2O3/c1-2-3-4-5-10-16-24-19-12-7-6-11-18(19)21-20(23)25-17-15-22-13-8-9-14-22/h6-7,11-12,21H,2-5,8-10,13-17H2,1H3
charge 0 multiplicity 1
57 atoms
O  -2.360846 -0.292009 -0.322342
O  2.001768 -1.040213 0.13419
O  -2.693273 -2.621886 -0.11855
N  -5.548162 1.657749 -0.303955
N  -0.552967 -1.607463 -0.028654
C  -6.570098 0.906624 0.478389
C  -5.877374 3.093373 -0.110623
C  -7.874985 1.746178 0.333864
C  -7.413181 3.116067 -0.265075
C  -4.14721 1.307291 -0.01033
C  -3.818092 -0.099367 -0.525659
C  4.94705 2.987028 -0.025554
C  4.896323 1.448802 0.112382
C  6.382224 3.557477 0.029452
C  3.453671 0.894615 0.051986
C  6.430373 5.096827 -0.102107
C  3.415275 -0.627061 0.203247
C  -1.928043 -1.62469 -0.150993
C  7.866791 5.660922 -0.051862
C  1.702351 -2.413228 0.24904
C  0.307725 -2.715725 0.160719
C  2.650176 -3.438308 0.434234
C  -0.117296 -4.060135 0.261869
C  2.213474 -4.781845 0.533958
C  0.838721 -5.086064 0.448043
H  -6.683064 -0.121417 0.091632
H  -6.274485 0.832162 1.556463
H  -5.584502 3.456809 0.908972
H  -5.353576 3.715998 -0.857906
H  -8.6014 1.251922 -0.332953
H  -8.362415 1.876011 1.315988
H  -7.86975 3.980498 0.247648
H  -7.677365 3.172333 -1.335022
H  -3.488476 2.031353 -0.524644
H  -3.912503 1.359852 1.083988
H  -4.361189 -0.895425 0.012849
H  -4.040613 -0.17803 -1.604867
H  4.338569 3.446445 0.78108
H  4.470395 3.284674 -0.982646
H  5.370377 1.15335 1.071647
H  5.506775 0.990097 -0.693324
H  6.862087 3.25758 0.984652
H  6.990978 3.102976 -0.780196
H  2.983538 1.172592 -0.91094
H  2.841576 1.350144 0.854214
H  5.946991 5.39567 -1.054664
H  5.824771 5.550394 0.708992
H  3.841884 -0.941721 1.178312
H  3.982157 -1.124888 -0.610765
H  8.484035 5.247694 -0.871954
H  7.873503 6.762349 -0.146541
H  8.361853 5.400914 0.902911
H  -0.092901 -0.6938 -0.083202
H  3.716983 -3.206442 0.501009
H  -1.184136 -4.283028 0.192941
H  2.950089 -5.579344 0.677602
H  0.50012 -6.124582 0.524856
