program: Gaussian 09
title: 000171495
version: EM64L-G09RevD.01
frameworkgroup: C1[X(C12H9ClN2O)]
method: RPBEPBE
basis: SDD
operation: Freq
keyword: #p
keyword: freq=noraman
keyword: PBEPBE/SDD
title: #p freq=noraman PBEPBE/SDD
converged: YES YES NO NO
title: Mulliken charges:
elementType: Cl O N N C C C C C C C C C C C C H H H H H H H H H
charge: 0.005141 -0.214984 -0.445648 0.084768 0.500718 0.301440 0.121677 -0.340277 -0.439616 -0.285821 -0.215289 -0.196719 -0.440285 -0.250636 -0.160932 -0.325543 0.319813 0.307340 0.220351 0.266927 0.230299 0.228674 0.231662 0.241734 0.255206
chargesum: 0.00000
title: Mulliken charges with hydrogens summed into heavy atoms:
elementType: Cl O N N C C C C C C C C C C C C
charge: 0.005141 -0.214984 -0.125836 0.084768 0.500718 0.301440 0.121677 -0.032936 -0.219265 -0.018894 0.015010 0.031955 -0.440285 -0.018974 0.080802 -0.070338
polarizability: 2.34333192e+02 1.59203820e+01 1.38914359e+02 -1.41372880e+00 1.08425086e+01 1.00910192e+02
1716.lowfreq: -8.8783 -0.0006 0.0009 0.0022 2.6446 7.5053 9.5208 38.5312 63.4076
frequency: 5.3166 38.4133 63.4020 74.7580 125.6079 142.1574 188.9077 230.1777 269.3598 327.7817 353.9299 364.3099 406.0084 408.9299 465.5247 512.3038 521.9353 594.8590 615.2485 628.9457 656.5164 696.3353 706.1585 723.1040 756.6058 771.2840 803.3153 831.3781 842.9356 861.9853 919.7926 940.5109 974.5560 982.8366 984.9013 1001.2629 1015.9715 1029.0522 1044.9967 1089.3042 1119.9355 1123.6067 1173.7988 1189.4695 1215.1663 1252.4369 1265.5331 1319.1580 1322.3167 1384.2392 1393.0415 1418.1759 1428.3070 1483.8800 1508.0703 1534.7359 1572.6192 1599.2229 1612.0351 1615.1889 3110.3606 3134.7895 3144.0036 3147.0420 3152.4175 3167.2207 3179.8105 3196.6998 3518.0811
redmass: 7.6923 4.8223 5.7099 5.4451 6.1091 10.0876 5.9909 5.8505 5.0257 7.1870 6.9079 7.0135 3.8475 5.1376 4.3348 3.1177 4.8903 5.5868 6.4130 8.0496 1.1641 2.0020 8.0295 7.4166 4.0241 1.7233 1.9526 2.7683 1.2700 7.1478 1.4304 1.3888 1.3563 1.4114 5.9102 1.3118 4.4775 2.3022 3.7096 1.5780 2.7256 1.6729 1.0515 1.1146 2.0123 2.2247 1.8306 8.0319 1.5068 5.8058 2.4501 2.0994 2.4534 2.3152 2.1630 5.1905 6.8108 7.1376 4.7640 6.1563 1.0889 1.0868 1.0887 1.0934 1.0922 1.0998 1.1001 1.0953 1.0767
irintensity: 1.0382 0.3976 0.0856 2.0457 2.7549 1.7747 3.5607 3.5270 2.0332 4.6168 0.6235 4.5029 6.2761 11.8415 2.8554 15.1254 11.4322 8.4739 2.6122 2.5905 27.6722 50.3116 3.0796 22.9481 14.7473 93.2695 39.1703 17.9882 0.2600 33.2420 11.2819 0.3834 0.2250 1.8904 0.0356 2.0890 15.3026 19.8116 25.0497 22.6762 56.2533 8.2746 0.4628 1.0338 6.5745 6.6323 51.9042 11.0788 60.0994 74.3191 102.8575 7.7140 105.5523 46.8460 339.8026 28.8726 52.3520 85.2143 103.1076 37.9824 13.8589 0.3524 1.1639 27.5733 11.8225 24.6266 19.0072 7.0764 15.3902
temp: 298.150 k
press: 1.00000 atm
elementType: 17 8 7 7 6 6 6 6 6 6 6 6 6 6 6 6 1 1 1 1 1 1 1 1 1
symmnumber: 1
zpe: 480013.8 jmol-1
zpe.correction: 0.182828 hartree
zpe.thermalcorrener: 0.196260 hartree
zpe.thermalcorrenthalpy: 0.197204 hartree
zpe.thermalcorrgfe: 0.139060 hartree
zpe.sumelectzpe: -1106.356519 hartree
zpe.sumelectthermal: -1106.343087 hartree
zpe.sumelectthermalent: -1106.342143 hartree
zpe.sumelectthermalfe: -1106.400287 hartree
dipole: 1.3028 -5.5900 -1.5274
dipole: 5.9396
quadrupole: -89.5237 -95.2857 -101.4332
quadrupole: 12.6848 -3.7905 1.9511
quadrupole: 5.8905 0.1285 -6.0190 12.6848 -3.7905 1.9511
hfenergy: -1106.5393464 hartree
pointgroup: C01 [X(C12H9Cl1N2O1)]
dipole: -0.4676271 -2.288836 0.0573668 debye
dipolederiv: -0.1645718 0.1649695 0.0873299 0.1515924 -0.6223124 -0.3068532 0.0906461 -0.3272699 -0.2292021 -0.7665662 0.1101383 -0.0777422 -0.3727972 -0.6412107 0.3305301 0.3402421 0.2723318 -0.5615799 -1.6679725 -0.2308103 0.2201756 -0.3854952 -0.3838953 0.0969456 0.4040843 0.0792867 -0.3404411 -0.665407 0.4115676 0.1484538 0.0182308 -0.4726631 -0.1873079 -0.116449 -0.0853838 -0.239275 1.1677172 0.0246184 -0.0545167 -0.1643489 0.0525217 0.0387481 0.0532149 0.0319185 0.0653679 -0.1178189 -0.0202153 -0.0558126 0.0652365 -0.3459041 -0.1486811 0.0413058 -0.1894983 -0.1216601 1.7672711 0.1086807 -0.0855737 0.8133731 0.7804549 -0.5801893 -0.7437923 -0.4691057 0.622012 -0.2753713 0.0117835 -0.0067786 0.1212884 -0.097493 -0.0495749 -0.0903184 -0.0363067 -0.1196082 -0.2578947 -0.0260408 0.021059 -0.1049976 -0.0626041 -0.1078263 0.0826834 -0.1116272 -0.1134424 0.0455725 -0.0884924 0.0131356 -0.1058303 0.1012622 0.1112955 0.0639323 0.0953177 -0.0145849 0.0665268 -0.0353991 0.0185519 -0.0981944 0.0418268 -0.1388184 0.063312 -0.1377691 -0.0325369 0.0534403 0.0125057 -0.0165536 0.0922697 0.0193873 -0.1267714 -0.0798521 -0.1239456 -0.0351988 0.4109607 -0.3892464 -0.1435073 -0.1750251 1.0607517 0.5958746 -0.0254681 0.5629928 0.33312 -0.0181091 -0.0229821 0.0087084 -0.0282707 -0.149688 -0.0198215 0.0120249 -0.0209922 -0.1615633 -0.3124278 0.0203932 -0.0296894 -0.1054241 -0.0145728 0.0133842 -0.0915808 0.057887 -0.0953969 0.4170044 -0.1878729 0.0209547 0.0395424 0.1673182 0.1534544 0.1630192 0.0877925 0.0310081 0.1784683 0.0036061 0.0137345 0.072838 0.1668969 0.0770467 -0.0517613 0.0730756 0.2051607 0.1700884 -0.0457934 0.0386522 -0.0269308 0.1054195 0.0540004 0.0311556 0.0485332 0.1332661 0.017685 0.0949607 -0.0694055 0.0776288 0.0255901 0.1070053 -0.0567058 0.1027606 0.0800008 0.0548112 -0.0544353 -0.0646329 -0.0541015 0.0571076 -0.0530584 -0.0830435 -0.0525691 0.0821225 0.0289776 0.0573167 -0.0422377 0.0820291 0.012955 0.1077029 -0.058849 0.1071232 0.068972 0.0095656 -0.0674727 0.0597343 -0.0845292 0.0264898 0.106815 0.0745898 0.1058874 0.0693891 -0.1355519 0.0153569 -0.0001775 0.015276 0.1196928 0.0373076 0.0018151 0.0363594 0.138186 0.0635788 0.0511691 0.0049499 0.0891932 -0.0192322 -0.0877096 0.0182419 -0.0934086 0.1163489 -0.0699768 0.0816943 -0.008812 0.0674464 0.0719014 -0.0234985 -0.042447 -0.0133904 0.1195356 unknown
polarizability: 235.1048692|-13.1832663|141.1770151|-0.353987|-1.6377859|97.8758589 unknown
InChI: InChI=1S/C12H9ClN2O/c13-11-10(7-4-8-14-11)12(16)15-9-5-2-1-3-6-9/h1-8,15H
charge 0 multiplicity 1
25 atoms
Cl 2.220787 2.179405 1.373451
O  0.136154 1.400427 -1.204182
N  -0.635053 -0.358046 0.164499
N  4.00103 0.263876 0.708106
C  -2.05286 -0.202737 0.105178
C  1.755476 -0.101842 -0.188097
C  0.351531 0.405259 -0.454792
C  -2.687835 0.805358 -0.668287
C  -2.837446 -1.113933 0.862689
C  2.197521 -1.318311 -0.76653
C  -4.097476 0.882823 -0.671309
C  -4.243228 -1.021435 0.848373
C  2.724984 0.633979 0.544585
C  -4.883153 -0.021278 0.079232
C  3.540723 -1.730492 -0.608036
C  4.412988 -0.904455 0.131666
H  -0.297767 -1.103361 0.779905
H  -2.080357 1.50702 -1.242195
H  -2.347528 -1.891209 1.464047
H  1.496173 -1.921484 -1.353396
H  -4.583314 1.662816 -1.267932
H  -4.837292 -1.728471 1.437548
H  -5.975652 0.051902 0.067915
H  3.904316 -2.660996 -1.052411
H  5.46628 -1.164215 0.278075
