program: Gaussian 09
title: 000171474
version: EM64L-G09RevD.01
frameworkgroup: C1[X(C10H14N4O)]
method: RPBEPBE
basis: SDD
operation: Freq
keyword: #p
keyword: freq=noraman
keyword: PBEPBE/SDD
title: #p freq=noraman PBEPBE/SDD
converged: YES YES NO NO
title: Mulliken charges:
elementType: O N N N N C C C C C C C C C C H H H H H H H H H H H H H H
charge: -0.352267 -0.469362 -0.244547 -0.627018 -0.644480 0.141822 0.367261 0.341316 -0.418019 -0.423386 -0.236287 -0.826356 -0.835740 0.167898 0.283020 0.229060 0.229122 0.221632 0.211768 0.223297 0.284563 0.222791 0.230609 0.247267 0.320702 0.309528 0.341999 0.402106 0.301702
chargesum: 0.00000
title: Mulliken charges with hydrogens summed into heavy atoms:
elementType: O N N N N C C C C C C C C C C
charge: -0.352267 -0.148660 -0.244547 0.024509 0.059329 0.141822 0.367261 0.341316 -0.188960 -0.194264 -0.014655 -0.106728 -0.135074 0.167898 0.283020
polarizability: 2.26378394e+02 2.03331143e+00 1.40264590e+02 -5.96602447e+00 -5.79339796e+00 8.49395992e+01
1716.lowfreq: -10.6040 -4.6609 -0.0004 0.0004 0.0007 4.6815 41.7853 53.0868 67.7517
frequency: 41.6728 53.0305 67.7462 111.1282 137.8317 150.9085 168.8322 172.3805 216.7333 236.2785 245.9887 253.9376 320.6968 324.8192 345.1951 421.1862 457.8022 468.3229 474.8871 515.6093 517.1873 527.4651 546.4731 550.9384 617.6143 689.4465 692.5456 717.3428 735.2190 773.4070 778.4708 836.1102 854.6816 895.1020 897.1135 933.9103 970.8497 987.0200 995.1627 1038.8985 1043.6519 1048.3943 1053.3210 1094.5081 1122.5638 1175.5861 1230.2916 1257.4849 1276.9763 1287.2799 1369.8367 1396.0267 1398.0942 1426.0873 1438.4914 1452.5176 1456.8148 1468.6458 1474.2783 1486.5293 1491.0442 1531.1608 1562.5361 1601.2526 1602.5065 1606.4492 1653.8593 2961.5647 2977.6807 3040.6887 3060.0982 3084.8717 3087.7288 3117.9390 3127.9173 3154.0990 3242.1677 3529.5219 3558.5271 3625.9126 3713.9711
redmass: 4.9290 4.2350 4.0838 4.5057 3.5373 1.0938 1.4648 2.4864 3.4653 3.1164 1.4279 2.2095 3.1476 3.6073 4.4010 4.1636 1.2185 3.0412 3.3863 3.5502 3.7788 1.1420 4.0109 3.7869 1.2973 6.6573 4.9159 4.7146 5.4752 1.9797 2.0642 4.7457 1.1324 5.0039 1.3146 2.8395 1.3407 1.5978 2.5214 1.7319 1.6183 1.7568 1.5846 1.7340 1.8904 1.1616 3.0018 1.8631 2.2478 3.3769 6.6042 1.2632 1.2748 2.5133 1.8064 1.6540 1.2909 1.0755 1.7838 1.3018 1.4546 2.6230 3.9657 2.8377 2.0196 5.7130 1.9922 1.0420 1.0361 1.0918 1.0968 1.1001 1.0985 1.0854 1.0918 1.0994 1.0646 1.0751 1.0451 1.0885 1.1052
irintensity: 5.3825 0.5286 0.8726 3.0660 7.2418 1.2314 0.1555 2.4506 3.8649 1.9977 20.5397 7.8829 0.2892 9.0234 12.5341 3.1979 422.6424 2.8052 3.0952 0.4398 1.2907 0.5631 7.6541 2.7954 110.7279 2.0331 9.9990 12.9876 23.1426 46.9566 14.8062 11.7042 162.7457 12.0738 0.1311 7.9472 0.3028 4.6932 18.2460 3.3620 6.7135 14.5540 11.0026 17.7558 18.2307 2.7551 63.5799 3.5091 118.5353 143.9459 83.4625 51.2849 10.4211 211.7494 18.6765 87.2232 6.6816 11.4434 628.9281 34.1129 258.1579 217.4904 305.2790 71.6349 77.3569 7.8625 716.7771 35.5604 28.1038 21.1315 11.4080 22.6804 23.3133 0.3505 29.8788 40.6437 225.1198 23.7440 73.0607 51.3814 35.7820
temp: 298.150 k
press: 1.00000 atm
elementType: 8 7 7 7 7 6 6 6 6 6 6 6 6 6 6 1 1 1 1 1 1 1 1 1 1 1 1 1 1
symmnumber: 1
zpe: 616249.2 jmol-1
zpe.correction: 0.234717 hartree
zpe.thermalcorrener: 0.249979 hartree
zpe.thermalcorrenthalpy: 0.250923 hartree
zpe.thermalcorrgfe: 0.192494 hartree
zpe.sumelectzpe: -682.632029 hartree
zpe.sumelectthermal: -682.616768 hartree
zpe.sumelectthermalent: -682.615824 hartree
zpe.sumelectthermalfe: -682.674252 hartree
dipole: 4.6797 1.4007 -0.7882
dipole: 4.9480
quadrupole: -51.8404 -82.8300 -91.9380
quadrupole: -0.1533 0.7109 -1.8105
quadrupole: 23.6957 -7.2938 -16.4019 -0.1533 0.7109 -1.8105
hfenergy: -682.8667463 hartree
pointgroup: C01 [X(C10H14N4O1)]
dipole: 1.7855965 0.7076983 -0.3168762 debye
polarizability: 225.3594192|9.5010896|141.1459529|-5.4613652|-6.9020376|85.0772104 unknown
InChI: InChI=1S/C10H14N4O/c1-6-4-3-5-7(2)8(6)13-10(15)14-9(11)12/h3-5,13H,11-12H2,1-2H3
charge 0 multiplicity 1
29 atoms
O  1.33542 -0.925864 0.917276
N  0.133018 0.398559 -0.614733
N  2.41325 0.668133 -0.53647
N  4.685597 1.127571 -0.628712
N  3.936292 -0.510028 0.911298
C  -1.202868 -0.016483 -0.306404
C  -1.58403 -1.389748 -0.370811
C  -2.15487 1.001682 0.007112
C  -2.929832 -1.722199 -0.073726
C  -3.491201 0.626645 0.277534
C  -3.879463 -0.730591 0.249602
C  -0.607291 -2.472654 -0.777715
C  -1.736857 2.461114 0.061836
C  1.314096 -0.026073 -0.008656
C  3.64639 0.408095 -0.069242
H  -3.232991 -2.775134 -0.116592
H  -4.224472 1.403665 0.524335
H  -4.91544 -1.011539 0.469805
H  -1.138649 -3.404834 -1.035866
H  -0.003977 -2.158359 -1.650043
H  0.107428 -2.676029 0.040085
H  -1.495895 2.866326 -0.942206
H  -2.547113 3.084294 0.476341
H  -0.837695 2.599016 0.690342
H  0.265859 1.205753 -1.228829
H  5.653468 1.014526 -0.3420
H  4.440875 1.79438 -1.356051
H  3.101584 -1.002857 1.284183
H  4.881068 -0.689265 1.242408
