program: Gaussian 09
title: 000171561
version: EM64L-G09RevD.01
frameworkgroup: C1[X(C22H29NO3)]
method: RPBEPBE
basis: SDD
operation: Freq
keyword: #p
keyword: freq=noraman
keyword: PBEPBE/SDD
title: #p freq=noraman PBEPBE/SDD
converged: YES YES NO NO
title: Mulliken charges:
elementType: O O O N C C C C C C C C C C C C C C C C C C C C C C H H H H H H H H H H H H H H H H H H H H H H H H H H H H H
charge: -0.196215 -0.224598 -0.264000 0.120179 -0.438891 -0.099138 0.134424 0.506452 0.503691 0.506694 -0.374351 -0.395036 -0.488528 -0.436383 -0.406332 -0.697439 -0.700757 -0.750032 -0.701567 -0.415579 -0.396375 -0.374042 -0.397936 0.329216 -0.242272 -0.684799 0.244449 0.251499 0.236218 0.229658 0.237448 0.244346 0.244103 0.226210 0.226220 0.217278 0.205686 0.222530 0.207143 0.215718 0.215473 0.217522 0.216905 0.223314 0.235397 0.214995 0.237158 0.229745 0.250417 0.245305 0.206811 0.208582 0.207709 0.232547 0.233229
chargesum: 0.00000
title: Mulliken charges with hydrogens summed into heavy atoms:
elementType: O O O N C C C C C C C C C C C C C C C C C C C C C C
charge: -0.196215 -0.224598 -0.264000 0.120179 -0.194443 0.152361 0.134424 0.506452 0.503691 0.506694 0.091525 -0.157587 -0.244182 -0.192279 -0.180122 -0.048255 -0.055365 -0.100132 -0.027862 -0.178421 -0.166631 -0.123625 -0.152631 0.329216 0.173121 -0.011313
polarizability: 3.30731306e+02 -1.01577431e+01 2.33742871e+02 -9.36204967e+00 7.57443869e+00 2.19599935e+02
1716.lowfreq: -6.8769 -5.4102 -0.0008 -0.0007 -0.0003 7.2241 16.7558 20.5983 34.3103
frequency: 15.8495 20.5306 34.2648 35.6559 42.3685 51.6444 59.5186 62.0867 75.4008 92.8738 101.6407 120.0236 131.8335 158.9658 171.5021 181.4699 197.7192 205.9504 217.1173 242.3586 243.3705 249.9369 260.4112 278.9258 291.3202 309.5451 320.4532 329.4835 346.0899 354.9293 384.9183 395.9595 405.5096 412.2300 435.2411 443.3500 454.9178 512.7026 535.8776 538.3879 564.7209 585.2622 630.0875 636.2290 641.8068 671.1506 682.4342 732.9616 748.6778 768.6458 770.1933 797.6279 813.8226 829.0210 833.3455 835.1623 843.3455 846.0439 854.6926 866.5238 903.9482 916.1546 919.7567 930.9854 936.6679 941.4155 960.3033 965.1181 972.9887 1003.3990 1008.9882 1019.1074 1022.7410 1025.1798 1037.0532 1058.3156 1092.2550 1109.2297 1114.2709 1115.2992 1121.5049 1129.8226 1136.3456 1180.8460 1190.0356 1201.3597 1206.9241 1209.0448 1215.7473 1216.0840 1227.0961 1233.7769 1258.9702 1263.2653 1267.4741 1273.0654 1289.7249 1305.6822 1320.1825 1327.9693 1339.3110 1364.9163 1372.6114 1374.3709 1376.4508 1385.6891 1399.8889 1402.1029 1403.2708 1409.9561 1420.2896 1432.3721 1459.5987 1460.5393 1460.9185 1465.0580 1468.5444 1477.1019 1477.2176 1478.2724 1486.4318 1487.4380 1487.6152 1495.3755 1502.5214 1505.5551 1576.2461 1580.4116 1619.5404 1623.4365 2952.6781 2971.3648 2972.3334 2977.4930 2984.9588 2997.5012 3003.7125 3005.2337 3010.7131 3054.4241 3065.6078 3066.7597 3067.2271 3069.3431 3075.7304 3078.5843 3081.8837 3083.6665 3089.6318 3095.0121 3106.5024 3119.0928 3119.5513 3127.2112 3128.3699 3142.5314 3160.4939 3161.9629 3166.8151
redmass: 3.1235 4.2632 4.2541 4.7513 4.7277 3.5150 3.8426 4.7711 3.7017 3.1383 3.8046 1.7786 4.0142 5.4704 3.6481 3.2246 2.2185 1.6362 1.4905 1.4580 2.0423 2.1148 1.2980 3.0260 2.8590 1.0694 2.9231 3.1317 3.9065 2.6919 3.7451 3.3134 2.8151 2.9617 4.4909 3.9489 2.9534 2.9051 3.8551 3.0998 3.1970 3.3153 6.9193 6.7962 4.4312 4.4702 3.9845 4.0406 3.7230 3.4743 2.5539 2.0618 1.5656 2.2246 1.1589 1.9259 2.1773 1.3261 2.1801 2.4030 3.3125 1.9127 1.7545 1.6538 1.3839 1.2073 1.3768 1.3648 1.3863 2.7569 2.9090 1.5115 3.8252 1.3910 2.8264 2.0905 1.8997 2.5633 2.0815 2.0982 1.5006 1.4970 1.4376 1.3321 2.2777 1.5782 2.9820 1.4178 2.6832 2.4529 2.6577 1.4710 1.8719 1.1420 2.0040 3.0993 1.2361 1.3356 1.4912 1.4966 1.4983 1.5808 1.1864 2.5604 1.3230 2.8321 1.2976 1.2103 1.2128 2.5650 3.4482 3.1633 1.0510 1.1251 1.0400 1.0486 1.0670 1.0654 1.0814 1.0757 1.0513 1.0494 1.1807 1.1638 1.9506 1.9646 6.4395 6.9097 6.2597 6.3862 1.0554 1.0350 1.0347 1.0358 1.0363 1.0362 1.0654 1.0791 1.1074 1.0914 1.0942 1.1001 1.0998 1.1004 1.0985 1.0995 1.0991 1.0995 1.1006 1.0989 1.1013 1.0883 1.0870 1.0894 1.0878 1.0958 1.0935 1.0936 1.0953
irintensity: 0.0353 0.0797 2.4230 0.0687 1.4342 0.0676 0.1149 0.0337 0.6568 1.1259 0.1230 3.3966 1.7462 1.1616 1.1944 1.2158 1.3000 0.6981 0.7995 0.9389 0.2708 0.2076 0.0203 0.4375 1.0850 0.0205 0.3192 0.6501 1.4689 0.0341 1.0971 0.4319 0.2130 0.3029 1.0150 0.6396 0.3801 6.2180 2.1827 14.8515 5.7194 56.1633 1.3124 1.0376 1.1853 6.9290 4.1492 3.1697 2.8907 2.8481 22.7814 35.2077 3.8551 8.9336 2.5311 24.8262 20.7338 4.1668 19.0779 4.4989 36.6306 2.7289 2.3008 2.1013 0.0497 0.2871 0.4776 0.3556 0.2033 8.3216 7.8710 5.0559 6.8407 0.1895 68.2177 1.2265 14.0716 16.6764 2.9867 0.9651 5.8589 24.0206 4.3381 138.0806 0.6624 2.9252 6.1127 0.9733 2.7395 4.4203 261.2304 37.2792 10.5269 0.0144 6.0985 36.3070 13.4091 7.4696 1.6143 5.4165 4.3134 2.5471 19.0758 22.3550 7.6180 7.8228 40.5372 12.6821 10.1051 12.4720 4.2779 85.8103 0.0870 1.5882 11.8388 0.4749 0.9885 3.9852 48.9127 14.9458 11.1387 15.7222 54.3672 3.2916 107.2870 37.6134 1.5720 13.4982 9.0574 49.4810 37.5271 30.8996 31.8532 36.9736 27.6873 27.7735 7.8633 10.3893 36.0635 2.4073 0.2526 2.8529 3.2713 21.5965 137.4390 30.1812 44.8214 35.6039 34.5017 28.0604 33.1745 15.7439 23.0331 11.9307 10.9564 19.8592 10.8996 12.4467 5.0680
temp: 298.150 k
press: 1.00000 atm
elementType: 8 8 8 7 6 6 6 6 6 6 6 6 6 6 6 6 6 6 6 6 6 6 6 6 6 6 1 1 1 1 1 1 1 1 1 1 1 1 1 1 1 1 1 1 1 1 1 1 1 1 1 1 1 1 1
symmnumber: 1
zpe: 1208417.5 jmol-1
zpe.correction: 0.460262 hartree
zpe.thermalcorrener: 0.487696 hartree
zpe.thermalcorrenthalpy: 0.488641 hartree
zpe.thermalcorrgfe: 0.399936 hartree
zpe.sumelectzpe: -1134.129112 hartree
zpe.sumelectthermal: -1134.101678 hartree
zpe.sumelectthermalent: -1134.100734 hartree
zpe.sumelectthermalfe: -1134.189439 hartree
dipole: 3.9308 -2.5976 -1.6448
dipole: 4.9905
quadrupole: -141.5335 -162.9676 -150.7916
quadrupole: 10.9733 -11.8865 4.2756
quadrupole: 10.2307 -11.2034 0.9727 10.9733 -11.8865 4.2756
hfenergy: -1134.5893742 hartree
pointgroup: C01 [X(C22H29N1O3)]
dipole: 1.5131717 1.0231234 0.7200372 debye
polarizability: 329.846076|11.1003955|233.5417913|12.3917921|8.4642256|220.6862442 unknown
InChI: InChI=1S/C22H29NO3/c1-6-20(23(24)25)21(17-10-14-19(15-11-17)26-7-2)16-8-12-18(13-9-16)22(3,4)5/h8-15,20-21H,6-7H2,1-5H3
charge 0 multiplicity 1
55 atoms
O  -1.883624 -3.341595 1.046941
O  -1.401247 -3.488037 -1.175086
O  5.067572 2.041919 -0.216319
N  -1.131707 -3.119729 0.029604
C  0.231822 -1.106755 -0.62887
C  0.203192 -2.38953 0.263995
C  -4.703084 2.143738 0.210097
C  -1.016176 -0.233247 -0.400144
C  -3.40177 1.328689 0.017825
C  1.536992 -0.321795 -0.45232
C  1.342684 -3.390617 -0.039142
C  -1.152759 0.602189 0.733578
C  -2.08605 -0.27035 -1.329643
C  -2.323822 1.36462 0.938777
C  -3.250858 0.495358 -1.123409
C  -5.913319 1.163861 0.291177
C  -4.897328 3.102657 -1.003297
C  -4.681606 2.996132 1.504689
C  1.313662 -4.65117 0.85019
C  2.113424 0.315054 -1.584317
C  2.179296 -0.147861 0.79749
C  3.279112 1.092427 -1.477333
C  3.354661 0.626892 0.927075
C  3.908457 1.253052 -0.216998
C  5.761166 2.248213 1.070908
C  6.972779 3.130616 0.783604
H  0.193042 -1.470406 -1.674191
H  0.167553 -2.133343 1.336612
H  2.295351 -2.849757 0.101217
H  1.282035 -3.671997 -1.107753
H  -0.334602 0.677991 1.45874
H  -2.00996 -0.915518 -2.213004
H  -2.387429 1.996499 1.829526
H  -4.057374 0.435943 -1.863448
H  -5.804394 0.474127 1.147959
H  -6.004808 0.552091 -0.623912
H  -6.855454 1.730211 0.417577
H  -4.053784 3.812744 -1.081866
H  -5.831403 3.68375 -0.885078
H  -4.962041 2.547782 -1.956326
H  -3.859015 3.735217 1.495631
H  -4.576129 2.366472 2.407517
H  -5.631507 3.55427 1.595662
H  2.18604 -5.29239 0.632281
H  0.404471 -5.25449 0.678163
H  1.345593 -4.387999 1.923713
H  1.634252 0.203017 -2.564406
H  1.775792 -0.624839 1.698933
H  3.720999 1.581842 -2.350569
H  3.820204 0.732184 1.911345
H  6.068211 1.265982 1.486449
H  5.068813 2.73532 1.788389
H  7.534026 3.320552 1.716537
H  7.648418 2.641075 0.061787
H  6.65713 4.099638 0.361141
