program: Gaussian 09
title: 000171508
version: EM64L-G09RevD.01
frameworkgroup: C1[X(C19H30O4)]
method: RPBEPBE
basis: SDD
operation: Freq
keyword: #pfreq=noraman
keyword: PBEPBE/SDD
title: #p freq=noraman PBEPBE/SDD
converged: YES YES NO NO
title: Mulliken charges:
elementType: O O O O C C C C C C C C C C C C C C C C C C C H H H H H H H H H H H H H H H H H H H H H H H H H H H H H H
charge: -0.273626 -0.250472 -0.428658 -0.194628 -0.387271 -0.381014 -0.364513 -0.372467 -0.392608 -0.353300 -0.564925 -0.356596 0.537489 -0.696810 -0.580404 -0.430231 0.370537 -0.225777 -0.380241 -0.280659 -0.271627 -0.296776 0.171898 0.196371 0.194189 0.191872 0.191403 0.190745 0.192836 0.189566 0.190263 0.214418 0.210311 0.187502 0.187249 0.205994 0.203647 0.195148 0.194814 0.209471 0.214890 0.209519 0.254032 0.232242 0.218458 0.247204 0.196655 0.235310 0.211128 0.190871 0.238356 0.223006 0.385212
chargesum: 0.00000
title: Mulliken charges with hydrogens summed into heavy atoms:
elementType: O O O O C C C C C C C C C C C C C C C C C C C
charge: -0.273626 -0.250472 -0.043446 -0.194628 0.003289 0.002260 0.019068 0.007362 0.032121 0.021452 -0.155284 0.033367 0.537489 -0.062930 -0.326372 -0.197990 0.370537 -0.007319 -0.133037 0.151306 0.130372 0.164586 0.171898
polarizability: 2.84006260e+02 -3.94942818e+00 2.12075505e+02 -1.02662892e+00 -1.72366251e+01 1.77600878e+02
1716.lowfreq: -6.3158 -0.3019 -0.0012 0.0006 0.0011 4.6327 6.3180 15.0135 19.3738
frequency: 3.7562 14.9784 19.2820 21.7510 26.0764 34.8543 36.3881 61.0649 64.0054 77.4548 81.6287 88.3351 105.5629 110.7731 135.4677 142.4000 144.0269 147.9754 151.2196 182.5007 229.0673 232.2455 245.4887 253.6068 298.7878 306.8985 321.8606 357.1253 390.0532 437.6983 440.5972 466.6875 470.1451 493.9676 506.8739 555.6249 582.7406 611.8387 625.3758 628.3903 700.3978 719.8755 724.2229 736.4831 737.5098 765.0120 783.4985 814.4978 841.3656 852.6847 871.4775 877.3989 878.8321 887.3139 893.0159 943.0646 958.3402 964.3416 983.7312 989.9629 993.8333 998.2652 1007.9092 1012.7890 1036.7263 1043.0485 1048.1914 1051.4681 1068.5597 1079.0208 1080.6039 1082.2389 1090.7877 1110.4961 1118.7966 1120.1719 1156.2463 1184.0487 1184.4639 1194.2087 1205.3139 1207.8283 1213.8314 1243.6448 1246.5322 1252.5235 1254.9067 1259.5282 1272.0370 1279.1212 1279.7490 1284.7529 1291.9455 1294.1537 1304.6860 1309.1704 1331.7056 1345.0418 1350.1023 1350.9076 1351.9270 1370.2812 1387.4148 1390.6523 1411.4728 1443.3983 1446.0146 1458.9207 1459.2507 1462.3280 1463.0238 1464.2815 1468.1586 1469.0183 1474.8815 1476.7894 1476.7989 1481.3161 1486.4680 1488.5005 1588.0897 1621.1845 1703.3902 2923.5001 2934.4485 2948.3044 2949.4559 2950.5032 2954.3897 2960.9786 2963.3681 2967.5218 2969.0602 2971.0380 2977.5417 2978.4090 2982.7529 2987.4174 2995.3974 2996.5023 3007.7540 3017.5049 3027.4344 3031.6901 3038.8785 3049.5601 3067.6050 3069.9551 3121.5777 3141.4994 3145.0674 3165.9555 3524.6061
redmass: 5.4001 5.3743 2.8610 3.6905 4.7760 3.8775 2.6078 4.7910 2.0439 2.6163 4.1983 2.1397 4.5785 2.0344 2.2483 2.6150 2.7097 4.1651 2.9028 4.1628 1.1154 4.7573 3.3452 2.9545 3.1932 3.6541 3.7562 3.1165 4.8018 3.5088 3.0518 3.3096 2.9474 2.6859 2.2920 4.3240 4.6514 4.4871 4.5864 1.4657 2.0338 1.0603 1.0746 1.6923 1.7876 1.1560 1.6076 1.2210 3.3693 2.8520 2.9031 1.4816 1.4345 1.9009 1.5486 1.5297 1.8308 1.3346 5.6708 4.3102 3.9093 2.1354 2.6774 1.1750 3.4956 2.3807 2.5488 3.1097 2.7040 1.5372 2.1812 2.2200 2.8901 1.4063 2.9816 2.7136 1.8442 1.1416 1.8052 1.0720 1.1028 1.2712 1.5059 1.3602 1.3747 1.7055 2.0645 1.2196 1.2249 1.2981 1.1021 1.0943 1.1239 1.1044 1.2616 1.3891 1.4287 1.5395 1.3855 1.6753 1.6208 1.6495 1.2161 3.8757 1.6385 1.4461 1.4043 1.0756 1.0725 1.2936 1.0720 1.0879 1.1197 1.0964 1.1891 1.1860 1.5577 1.0909 1.0925 1.0953 6.1250 6.7067 9.2525 1.0588 1.0577 1.0586 1.0586 1.0590 1.0593 1.0589 1.0587 1.0586 1.0588 1.0367 1.0978 1.0595 1.0963 1.0979 1.1004 1.1033 1.1022 1.1028 1.1045 1.1044 1.1048 1.1047 1.1007 1.0992 1.0863 1.0925 1.0926 1.0963 1.0642
irintensity: 0.0817 1.4203 0.2434 1.0566 0.2380 0.3853 0.2189 2.9422 0.0039 1.9326 2.2965 1.3813 6.5674 0.3680 0.3303 0.2721 0.0359 4.8759 0.8559 0.9312 0.0007 1.0290 1.2351 1.5316 0.0717 0.2804 0.4032 0.1136 16.1462 1.2548 2.7303 0.8825 2.8045 14.3750 17.6846 0.8036 28.7026 3.6823 0.4793 145.6159 28.4864 15.3463 0.0171 15.3916 4.7385 0.3042 40.1125 0.5211 6.4786 13.0197 2.1566 2.8767 1.9798 6.8074 17.1357 16.9819 31.5904 0.6721 2.5663 1.0037 7.0685 27.7391 260.8916 2.6879 0.1394 71.5529 170.9348 1.5420 0.3099 13.8232 0.1924 0.4462 31.9534 3.1384 37.0158 24.5591 107.2323 1.0237 0.1194 1.8903 8.0749 16.9156 0.3136 18.6665 1.2359 70.3779 59.1744 23.8534 2.9430 3.2402 2.3274 1.1234 0.5813 0.1412 1.7854 2.2449 1.2688 0.5862 2.2843 0.1331 0.5068 6.9350 11.1693 19.3663 12.7536 60.2030 24.5621 0.0843 0.0268 4.1791 0.1734 0.7780 29.0290 0.5163 8.5407 6.6937 34.9414 2.7354 0.8027 36.6420 64.1938 111.3741 216.4549 47.8719 54.7382 2.3017 0.0344 4.0056 0.0645 45.6691 56.7958 105.8871 41.2919 36.4751 36.6316 103.0444 0.7876 0.7659 0.7776 44.5907 1.4625 0.1866 1.0065 34.7162 83.8598 146.2015 100.1682 55.5417 6.5425 30.1685 6.5972 15.7269 28.8765
temp: 298.150 k
press: 1.00000 atm
elementType: 8 8 8 8 6 6 6 6 6 6 6 6 6 6 6 6 6 6 6 6 6 6 6 1 1 1 1 1 1 1 1 1 1 1 1 1 1 1 1 1 1 1 1 1 1 1 1 1 1 1 1 1 1
symmnumber: 1
zpe: 1189866.8 jmol-1
zpe.correction: 0.453196 hartree
zpe.thermalcorrener: 0.480023 hartree
zpe.thermalcorrenthalpy: 0.480968 hartree
zpe.thermalcorrgfe: 0.387303 hartree
zpe.sumelectzpe: -1041.083872 hartree
zpe.sumelectthermal: -1041.057045 hartree
zpe.sumelectthermalent: -1041.056101 hartree
zpe.sumelectthermalfe: -1041.149766 hartree
dipole: -2.0403 -0.5383 -1.7728
dipole: 2.7559
quadrupole: -110.5510 -130.2571 -144.5055
quadrupole: -1.5502 9.3223 -8.6143
quadrupole: 17.8869 -1.8193 -16.0676 -1.5502 9.3223 -8.6143
hfenergy: -1041.5370684 hartree
pointgroup: C01 [X(C19H30O4)]
dipole: -0.8328518 -0.1059518 -0.6861359 debye
polarizability: 282.0175508|-12.2847645|214.5044315|-4.8917817|-16.1789071|177.1606608 unknown
InChI: InChI=1S/C19H30O4/c1-2-3-4-5-6-7-8-10-17-11-9-12-18(15-17)23-14-13-22-16-19(20)21/h9,11-12,15,20H,2-8,10,13-14,16H2,1H3
charge 0 multiplicity 1
53 atoms
O  -3.753653 -0.512247 -0.428082
O  -5.520792 1.838933 0.309074
O  -6.155171 5.388096 -0.172998
O  -5.240846 4.273069 1.658309
C  4.268896 -0.462575 0.157564
C  5.674378 -0.367643 -0.477881
C  3.26499 -1.270921 -0.695127
C  6.677216 0.444466 0.372648
C  1.864026 -1.369722 -0.052614
C  8.084446 0.536065 -0.259265
C  0.859124 -2.181713 -0.917035
C  9.086002 1.351312 0.590563
C  -0.514802 -2.288189 -0.271654
C  10.490222 1.434932 -0.046093
C  -1.546153 -1.388717 -0.618169
C  -0.769453 -3.269571 0.726417
C  -2.810929 -1.457695 0.015716
C  -2.028695 -3.334741 1.355478
C  -3.0635 -2.433202 1.011047
C  -5.08115 -0.531308 0.19891
C  -5.885991 0.608097 -0.404655
C  -6.073006 3.017059 -0.326995
C  -5.752254 4.234097 0.527697
H  3.869895 0.560369 0.320413
H  4.35174 -0.926267 1.162862
H  5.591328 0.09318 -1.48465
H  6.07443 -1.391042 -0.637438
H  3.66548 -2.293143 -0.862628
H  3.177499 -0.803945 -1.698829
H  6.75753 -0.014166 1.380657
H  6.278494 1.468765 0.529313
H  1.455348 -0.353074 0.115389
H  1.945077 -1.840987 0.947817
H  8.005707 0.993027 -1.268207
H  8.485719 -0.487738 -0.413391
H  0.777053 -1.699701 -1.9109
H  1.277364 -3.194387 -1.085013
H  8.68562 2.374646 0.742295
H  9.162094 0.895593 1.599105
H  10.925733 0.426402 -0.178818
H  11.185996 2.023621 0.579956
H  10.445162 1.913245 -1.042957
H  -1.388361 -0.619833 -1.382614
H  0.019629 -3.979424 1.001417
H  -2.217913 -4.094676 2.122392
H  -4.032759 -2.50183 1.513253
H  -5.577166 -1.503131 -0.005613
H  -4.999644 -0.385281 1.29428
H  -5.655841 0.690692 -1.488279
H  -6.97466 0.413071 -0.281805
H  -5.652348 3.177492 -1.343158
H  -7.180579 2.95828 -0.433611
H  -5.967329 6.19146 0.383506
