program: Gaussian 09
title: 000171543
version: EM64L-G09RevD.01
frameworkgroup: C1[X(C18H22Cl2N2O3)]
method: RPBEPBE
basis: SDD
operation: Freq
keyword: #p
keyword: freq=noraman
keyword: PBEPBE/SDD
title: #p freq=noraman PBEPBE/SDD
converged: YES YES NO NO
title: Mulliken charges:
elementType: Cl Cl O O O N N C C C C C C C C C C C C C C C C C C H H H H H H H H H H H H H H H H H H H H H H
charge: 0.015202 0.010023 -0.242665 -0.197944 -0.281399 -0.112672 0.015432 -0.384290 -0.326810 -0.322652 -0.262264 -0.670943 -0.671194 -0.046014 0.439437 0.269195 -0.309482 -0.354058 -0.281443 -0.353392 0.431441 -0.359322 -0.268624 -0.167132 -0.514941 0.210834 0.222190 0.206259 0.189531 0.204854 0.187699 0.228803 0.204759 0.206510 0.228229 0.208123 0.211419 0.228053 0.206263 0.261671 0.260870 0.266823 0.254672 0.262973 0.234204 0.241737 0.220034
chargesum: 0.00000
title: Mulliken charges with hydrogens summed into heavy atoms:
elementType: Cl Cl O O O N N C C C C C C C C C C C C C C C C C C
charge: 0.015202 0.010023 -0.242665 -0.197944 -0.281399 -0.112672 0.015432 0.048734 0.068980 0.069900 0.171298 -0.028082 -0.025458 -0.046014 0.439437 0.269195 -0.309482 -0.092386 -0.281443 -0.092522 0.431441 -0.092499 -0.013952 0.095840 0.181035
polarizability: 3.36977107e+02 1.09235483e+01 2.54790052e+02 2.91678389e+00 1.29245236e+01 1.87706644e+02
1716.lowfreq: -9.0087 -1.9324 -0.0024 -0.0023 -0.0020 3.9920 9.8684 15.1523 22.9973
frequency: 6.8865 15.0056 22.9670 25.9594 45.7644 48.5051 60.6684 67.3654 78.0002 80.1616 89.1721 93.6553 114.6693 131.0987 142.3113 155.8791 161.9749 196.9701 198.5156 208.5922 210.1137 216.3297 240.4341 265.7124 272.9049 285.1525 289.6607 302.1334 325.7056 353.0979 397.5858 413.5424 423.4584 450.3669 457.4483 491.3630 504.8051 513.7269 579.4601 587.7289 594.6615 621.5877 663.9177 697.7106 725.9001 737.9830 740.6817 747.0397 791.8416 795.6727 800.9342 808.4954 821.4340 837.8915 869.6221 881.1000 885.2043 902.9591 914.2732 931.6902 956.5795 966.3987 983.5291 992.2558 1022.0677 1053.6001 1060.9409 1063.1369 1074.2322 1076.2352 1084.9518 1092.5216 1109.0404 1123.7069 1134.8315 1141.1617 1152.9325 1157.2087 1199.3439 1206.8528 1211.4626 1226.6048 1233.0275 1273.7562 1286.3201 1290.4978 1320.7954 1323.4532 1329.8231 1361.8227 1363.0267 1365.6436 1366.9923 1383.3746 1386.5380 1387.7461 1425.2910 1446.4988 1458.8822 1461.7068 1461.7785 1462.1395 1469.8650 1472.4715 1473.4460 1481.0248 1486.0081 1488.6118 1491.7567 1500.4151 1538.0420 1566.5195 1591.9758 2851.4594 2860.4658 2905.8574 2974.1365 2982.6670 2983.6143 3001.9786 3022.9778 3035.6641 3052.7406 3072.3318 3073.7057 3076.3153 3082.0004 3092.0354 3092.4428 3130.5076 3159.7324 3179.7232 3221.6968 3237.0360 3266.7832
redmass: 3.5801 5.5923 5.2189 4.9258 4.4000 4.5602 4.1519 3.1403 5.2011 3.3058 3.0213 2.2120 3.4522 3.0342 1.3851 2.2475 2.7433 3.2354 7.9804 1.6144 6.5944 2.0511 5.0669 4.9739 4.7260 3.0301 4.2504 3.3900 3.0242 7.3808 5.5288 5.3360 3.4861 3.9528 4.5235 3.0255 6.9574 5.1400 6.7309 3.0280 6.2394 6.6645 4.6443 5.6523 6.9352 1.3153 3.9613 3.7568 1.2029 1.1469 1.6445 2.3194 1.3482 1.6055 6.6440 4.7653 1.3814 6.2276 2.0076 5.8778 1.6272 4.9385 3.8571 2.5101 2.0966 2.6403 2.7017 1.6927 3.2170 1.9917 2.1475 2.8551 1.2380 1.6836 1.5243 1.4514 1.3747 1.3336 3.3727 2.2798 1.7137 1.7834 2.7829 1.1212 1.2112 1.2314 3.9780 1.4442 5.5251 1.5741 2.7171 2.5743 1.5431 1.4235 1.2394 1.2431 1.5348 4.2383 1.5176 1.3209 1.1859 1.0535 1.0615 1.0536 1.0647 1.0559 1.0700 1.0780 1.0762 5.8042 7.1287 8.1319 7.5479 1.0722 1.0714 1.0704 1.0321 1.0358 1.0357 1.0582 1.0875 1.0871 1.0904 1.1034 1.0990 1.0982 1.1062 1.1003 1.1003 1.1018 1.0883 1.0976 1.0915 1.0988 1.1084
irintensity: 0.0878 0.6052 0.0822 0.5177 0.5167 0.0635 0.9052 0.3246 2.2831 3.9667 0.9605 0.3541 1.7965 0.4954 0.1068 2.9960 1.8916 1.1862 3.2400 0.9727 2.2865 0.8249 1.6973 1.5380 1.3681 2.2121 0.5802 0.4303 4.3866 2.2172 0.6987 5.1431 12.2243 4.3931 20.6032 3.2578 15.3418 1.3875 10.7260 5.5733 12.4011 26.2706 4.9492 7.1735 60.9212 68.9232 10.6218 4.3653 9.7966 5.0575 1.5567 20.1569 19.1453 57.4422 21.5733 66.4493 0.3452 32.8024 4.4636 242.0499 15.0082 50.6266 187.7538 23.1638 5.3478 21.6844 30.1556 26.9532 11.9553 15.1593 2.6585 10.8098 6.9544 6.6684 10.1102 2.3984 2.7839 5.7880 45.9301 36.2765 6.1462 19.0778 121.6638 2.1744 15.7265 23.7775 49.9909 7.0531 15.9024 6.1892 9.9414 20.6849 5.7627 6.6016 26.1124 19.8292 35.6540 24.3825 47.1184 17.0482 10.5666 7.6439 0.9611 18.2435 9.5100 14.4612 8.8311 18.6338 7.8489 22.1268 3.1967 9.6565 37.7434 33.3574 172.7529 78.9235 76.3610 38.8409 27.1127 68.8856 17.5022 19.4733 7.1771 27.2986 22.7974 97.3007 50.0401 34.1440 47.7653 23.1220 2.9269 2.9753 5.4128 0.3743 0.1415
temp: 298.150 k
press: 1.00000 atm
elementType: 17 17 8 8 8 7 7 6 6 6 6 6 6 6 6 6 6 6 6 6 6 6 6 6 6 1 1 1 1 1 1 1 1 1 1 1 1 1 1 1 1 1 1 1 1 1 1
symmnumber: 1
zpe: 961140.7 jmol-1
zpe.correction: 0.366079 hartree
zpe.thermalcorrener: 0.393350 hartree
zpe.thermalcorrenthalpy: 0.394294 hartree
zpe.thermalcorrgfe: 0.302810 hartree
zpe.sumelectzpe: -1952.396568 hartree
zpe.sumelectthermal: -1952.369297 hartree
zpe.sumelectthermalent: -1952.368353 hartree
zpe.sumelectthermalfe: -1952.459837 hartree
dipole: 0.2990 1.2951 -3.9542
dipole: 4.1717
quadrupole: -134.0178 -154.4849 -159.9084
quadrupole: -0.2150 11.6219 2.3921
quadrupole: 15.4526 -5.0145 -10.4380 -0.2150 11.6219 2.3921
hfenergy: -1952.7626467 hartree
pointgroup: C01 [X(C18H22Cl2N2O3)]
dipole: 0.0846671 0.5963 -1.5267548 debye
polarizability: 338.1630662|5.6401862|251.8379636|-2.5086278|16.4668472|189.4727722 unknown
InChI: InChI=1S/C18H22Cl2N2O3/c1-4-22(5-2)10-12-25-21-18(15-7-6-11-24-15)13-8-9-14(23-3)17(20)16(13)19/h6-9,11H,4-5,10,12H2,1-3H3
charge 0 multiplicity 1
47 atoms
Cl -2.348085 1.609928 2.081611
Cl -5.229668 0.157806 2.068395
O  1.909973 0.415209 -0.171511
O  0.820429 2.877947 -0.344155
O  -5.508903 -1.960485 -0.154329
N  5.368359 -0.993995 -0.008863
N  0.600483 -0.178617 -0.024294
C  4.292009 0.021815 -0.129884
C  5.629432 -1.70187 -1.291852
C  6.602225 -0.474771 0.637783
C  2.923581 -0.641833 0.080999
C  6.216823 -3.112559 -1.095965
C  6.445439 -0.279053 2.157726
C  -0.39067 0.688475 -0.212066
C  -1.745411 0.0409 -0.158877
C  -0.350092 2.106657 -0.548652
C  -2.735775 0.391319 0.796717
C  -2.047021 -0.994883 -1.078703
C  -3.998574 -0.242584 0.801965
C  -3.301706 -1.630803 -1.082288
C  -4.297267 -1.252442 -0.153994
C  -1.343009 2.931749 -1.087507
C  -0.78558 4.251177 -1.223634
C  0.520634 4.180251 -0.760591
C  -6.700943 -1.223115 -0.631236
H  4.30464 0.541558 -1.116891
H  4.427848 0.800362 0.640522
H  4.665103 -1.795457 -1.825702
H  6.299026 -1.100539 -1.958473
H  7.406873 -1.211436 0.461265
H  6.940489 0.48266 0.165184
H  2.819862 -1.01629 1.114273
H  2.756306 -1.477997 -0.623503
H  6.352676 -3.61291 -2.073124
H  5.537763 -3.722601 -0.47529
H  7.202052 -3.08622 -0.596047
H  5.663769 0.463728 2.400563
H  6.166618 -1.234066 2.635847
H  7.393882 0.077874 2.601199
H  -1.275063 -1.287563 -1.795807
H  -3.537504 -2.430124 -1.790465
H  -2.351062 2.618471 -1.350409
H  -1.284294 5.136823 -1.611566
H  1.328276 4.900195 -0.660694
H  -6.897558 -0.330698 -0.010899
H  -7.534027 -1.93491 -0.536772
H  -6.568857 -0.930485 -1.690405
