program: Gaussian 09
title: 000012580
version: EM64L-G09RevD.01
frameworkgroup: C1[X(C9H12O)]
method: RPBEPBE
basis: SDD
operation: Freq
keyword: #pfreq=noraman
keyword: PBEPBE/SDD
title: #p freq=noraman PBEPBE/SDD
converged: NO YES NO NO
title: Mulliken charges:
elementType: O C C C C C C C C C H H H H H H H H H H H H
charge: -0.436937 -0.536702 -0.356825 0.510979 -0.388990 -0.387598 -0.684626 -0.385322 -0.346748 0.277276 0.199265 0.200204 0.210728 0.209254 0.230483 0.232490 0.209537 0.210185 0.219894 0.215079 0.247332 0.351043
chargesum: 0.00000
title: Mulliken charges with hydrogens summed into heavy atoms:
elementType: O C C C C C C C C C
charge: -0.085894 -0.137232 0.063157 0.510979 -0.158507 -0.155109 -0.045010 -0.170244 -0.099416 0.277276
polarizability: 1.38993938e+02 1.98000047e+00 9.84027075e+01 -8.37408625e+00 -2.53859948e-01 5.92176472e+01
1716.lowfreq: -10.5250 -0.0004 0.0005 0.0007 10.2545 23.8331 41.7081 76.9760 81.9227
frequency: 40.0646 76.9214 81.8829 195.1935 224.8784 289.5043 301.1901 350.4590 372.6852 403.3461 411.2766 491.0748 542.0686 636.4265 714.4030 746.5608 755.9395 805.1560 821.3322 838.4565 867.0168 889.6200 931.3965 959.1915 1003.6941 1050.7813 1057.1421 1095.8302 1115.6146 1144.8629 1179.0766 1217.1406 1222.5198 1246.7205 1284.4776 1285.3229 1320.2950 1343.1749 1387.7934 1390.5695 1425.2308 1470.1824 1476.0856 1476.5520 1489.1794 1504.1567 1597.9316 1627.2904 2970.2100 2972.5880 2982.1871 3014.4081 3040.2586 3069.9833 3072.4869 3105.3439 3120.9159 3132.4171 3167.5436 3581.7977
redmass: 2.6871 4.5690 1.8394 4.3751 1.1166 3.2124 2.7504 1.1092 5.0516 3.1722 2.9408 3.8009 2.9869 6.7525 3.6756 1.0953 3.7995 1.5122 2.4839 2.0010 1.2378 1.9492 1.3607 1.3549 2.8073 2.9352 1.4322 2.1634 1.3168 1.3648 1.1120 2.1746 1.3895 2.9145 1.2146 1.3162 1.2502 1.4812 1.2131 6.0981 2.7955 1.0774 1.0439 1.0610 1.0922 2.7739 6.4123 6.4723 1.0493 1.0451 1.0603 1.0999 1.1033 1.1013 1.0992 1.0873 1.0899 1.0961 1.0951 1.0660
irintensity: 0.4399 0.3399 0.0510 0.1085 0.0333 0.0096 3.3438 145.9757 0.3581 10.0411 1.6358 13.4666 27.2084 0.6479 2.9269 4.8261 16.2025 33.3427 12.2820 33.5126 1.5377 1.3457 0.0735 0.1857 3.0633 0.5131 7.6238 20.2177 46.6233 199.9857 4.1093 1.9557 0.5108 28.6561 0.3938 0.3824 12.1307 0.9658 10.9337 13.5494 13.7824 0.0187 12.6890 1.4590 17.7575 99.0552 7.8417 26.1610 6.7093 50.9272 60.2972 0.8158 13.7289 78.0277 48.0612 19.5020 20.8908 16.8411 7.2052 34.4349
temp: 298.150 k
press: 1.00000 atm
elementType: 8 6 6 6 6 6 6 6 6 6 1 1 1 1 1 1 1 1 1 1 1 1
symmnumber: 1
zpe: 486807.2 jmol-1
zpe.correction: 0.185415 hartree
zpe.thermalcorrener: 0.195512 hartree
zpe.thermalcorrenthalpy: 0.196457 hartree
zpe.thermalcorrgfe: 0.149403 hartree
zpe.sumelectzpe: -424.624389 hartree
zpe.sumelectthermal: -424.614292 hartree
zpe.sumelectthermalent: -424.613348 hartree
zpe.sumelectthermalfe: -424.660401 hartree
dipole: 0.6350 -1.5773 0.0301
dipole: 1.7006
quadrupole: -57.7869 -54.2036 -64.3195
quadrupole: 7.5120 -1.2766 -0.9097
quadrupole: 0.9831 4.5664 -5.5495 7.5120 -1.2766 -0.9097
hfenergy: -424.8098043 hartree
pointgroup: C01 [X(C9H12O1)]
dipole: -0.254113 0.6188796 0.0078023 debye
dipolederiv: -1.5107652 -0.0317131 -0.1846206 -0.0125821 -0.061635 -0.004021 -0.2205817 -0.0077011 -0.46663 -0.0468512 -0.0007255 0.0404972 -0.0023403 0.1614504 -0.0010643 0.1948675 0.0024663 0.1097772 0.0322456 -0.0017382 -0.0117215 -0.0007354 0.1481994 0.0002173 -0.143057 -0.0017849 0.0833907 0.2570109 -0.005893 0.0238148 0.0252889 -0.1991392 0.0057229 0.0384257 -0.0021046 -0.0991596 0.0109939 0.1013918 0.0458769 -0.080412 0.1284913 -0.0177167 0.0333851 0.024877 -0.1346647 0.0342781 -0.0743239 0.0537695 0.064275 0.1422913 0.012257 0.0396497 -0.0216896 -0.1416034 -0.1070572 -0.0018473 0.0050047 -0.0013814 0.1080661 -0.0004037 0.0951452 0.0010086 0.0629845 -0.3098949 -0.050933 -0.0101339 0.2792825 0.0208718 0.0436329 -0.0229856 -0.0129289 -0.2031807 -0.2744906 0.0306041 -0.0120032 -0.2727277 0.0389831 -0.0456356 -0.0193348 0.0064808 -0.1695433 1.3906095 0.058198 0.2478653 0.0538113 0.0357179 0.0125335 0.2728522 0.011534 0.1148596 -0.0026659 0.027186 -0.0327686 0.0755311 -0.0768931 0.1340385 -0.0399251 0.0747646 -0.0142372 -0.0016224 -0.0282609 -0.0320596 -0.0746044 -0.0775127 -0.132943 -0.0395555 -0.0750484 -0.0130167 0.017854 0.0712061 -0.0367541 0.0565413 -0.0711128 0.1292455 -0.0320113 0.0822613 -0.0160742 0.0181196 -0.0703483 -0.0351888 -0.0558921 -0.0746676 -0.1304009 -0.0303186 -0.0830578 -0.0163332 0.0323645 0.10294 -0.032261 0.0961652 -0.0551484 0.0177754 -0.0294376 0.0210734 0.1330707 0.0366504 -0.1064328 -0.0299895 -0.0946582 -0.0564249 -0.0153559 -0.0271411 -0.0198564 0.1325182 0.0445063 0.0249893 -0.0273514 0.0857729 -0.0881827 0.1196768 -0.0828102 0.1185921 0.0123842 0.0466154 -0.0231715 -0.0258903 -0.0837206 -0.0892314 -0.1195624 -0.0810203 -0.1195194 0.0128658 -0.0834044 -0.001531 0.1140887 -0.000878 0.0998157 0.0005614 0.1606349 0.0010198 -0.1015823 -0.024563 -0.1126969 -0.0349168 -0.1068167 -0.0547519 -0.0164078 -0.0410586 -0.019447 0.1649089 0.0395891 0.0781315 -0.0240077 0.0826127 -0.0221503 0.0146234 -0.0289182 0.0148658 0.1658084 0.4004776 0.0149686 -0.0012501 -0.0325318 0.0429631 -0.0067733 0.0031953 0.0041945 0.3834572 unknown
polarizability: 138.8762177|2.2942316|98.4337326|8.7743204|0.1494719|59.304342 unknown
InChI: InChI=1S/C9H12O/c1-2-3-8-4-6-9(10)7-5-8/h4-7,10H,2-3H2,1H3
charge 0 multiplicity 1
22 atoms
O  3.686496 -0.050576 0.441522
C  -1.980593 0.003313 -0.681555
C  -2.819527 0.00104 0.627274
C  -0.481675 0.010144 -0.421001
C  0.231971 1.227181 -0.279852
C  0.241678 -1.202018 -0.265235
C  -4.339024 -0.008147 0.356942
C  1.614734 1.24267 0.006979
C  1.6219 -1.209083 0.021321
C  2.30892 0.018344 0.158562
H  -2.266935 0.889967 -1.281907
H  -2.258321 -0.888103 -1.278783
H  -2.538196 -0.882361 1.23412
H  -2.54834 0.890051 1.230624
H  -0.298662 2.179884 -0.400236
H  -0.283316 -2.159324 -0.374744
H  -4.645854 0.882829 -0.223369
H  -4.63489 -0.903312 -0.22253
H  -4.914224 -0.011358 1.300979
H  2.147156 2.198298 0.106749
H  2.178111 -2.144289 0.136104
H  4.073992 0.856548 0.517336
