program: Gaussian 09
title: 000171523
version: EM64L-G09RevD.01
frameworkgroup: C1[X(C18H35NO2)]
method: RPBEPBE
basis: SDD
operation: Freq
keyword: #p
keyword: freq=noraman
keyword: PBEPBE/SDD
title: #p freq=noraman PBEPBE/SDD
converged: YES YES NO NO
title: Mulliken charges:
elementType: O O N C C C C C C C C C C C C C C C C C C H H H H H H H H H H H H H H H H H H H H H H H H H H H H H H H H H H H
charge: -0.414485 -0.238452 -0.585609 -0.392169 -0.357055 -0.349135 -0.372608 -0.364755 -0.412529 -0.369232 -0.393959 -0.414194 -0.359088 -0.470045 -0.475663 -0.177425 -0.363846 -0.190197 -0.173276 -0.699615 0.180506 0.204103 0.195896 0.205494 0.189053 0.190353 0.205058 0.187734 0.182456 0.192039 0.205789 0.198430 0.199472 0.193302 0.183694 0.189272 0.202781 0.198273 0.214110 0.183152 0.188407 0.200637 0.208064 0.204997 0.202551 0.247722 0.220150 0.189260 0.226527 0.212811 0.205270 0.217955 0.211821 0.266769 0.293598 0.375831
chargesum: 0.00000
title: Mulliken charges with hydrogens summed into heavy atoms:
elementType: O O N C C C C C C C C C C C C C C C C C C
charge: -0.038654 -0.238452 -0.025242 0.007831 0.037493 0.046276 -0.002419 0.033072 -0.014627 0.007765 -0.001906 -0.001812 0.012471 -0.061344 -0.068115 0.070297 0.045563 0.036331 0.039535 -0.064569 0.180506
polarizability: 2.31060041e+02 -2.27644805e+00 2.14736754e+02 -2.29708475e+00 8.48502800e+00 1.82821032e+02
1716.lowfreq: -16.5754 -7.5416 -6.1947 -5.2508 -0.0007 -0.0006 -0.0004 13.8040 17.3460
frequency: -12.5127 13.8018 17.1820 24.8917 34.2587 48.7475 52.6924 58.3967 62.9104 78.4460 89.4801 93.3040 100.3001 106.3039 125.0971 143.3000 152.7330 163.8728 179.5585 203.6250 223.1823 230.4288 232.7703 241.3816 262.4622 265.8869 285.9081 314.7417 337.5845 375.3121 388.1318 419.8130 449.7702 461.4438 488.2885 496.0554 510.3054 588.9283 600.1828 624.6337 712.2072 717.0040 720.9193 726.5406 736.1901 749.8115 768.1138 784.8818 812.8660 834.5209 846.0040 871.5482 886.2492 896.2531 905.8575 942.1370 963.9217 966.4252 982.1518 985.6995 1008.9704 1012.5597 1018.7516 1035.6436 1039.2420 1051.2886 1063.7114 1066.6531 1068.2444 1079.8219 1084.8186 1089.6668 1106.0786 1113.6107 1116.1933 1121.2145 1138.2814 1168.7636 1175.6182 1190.9446 1196.5014 1219.5612 1227.3285 1232.6096 1237.0050 1252.7038 1262.8736 1264.9640 1272.4700 1278.1079 1279.1383 1284.7380 1286.8717 1290.0187 1292.4098 1295.6221 1300.6602 1313.4629 1316.4499 1322.0678 1339.7050 1345.2279 1345.9588 1350.4601 1351.9474 1355.2706 1358.6171 1386.8358 1400.9420 1452.1614 1455.3213 1456.7614 1459.8676 1461.4757 1463.1129 1464.0075 1465.2061 1468.5372 1471.2285 1475.7409 1478.2500 1480.7527 1484.3408 1489.6799 1613.6685 1671.2548 1682.8462 2944.5248 2946.6551 2950.1945 2952.5571 2955.0550 2956.3620 2958.3829 2960.9642 2963.3606 2963.7731 2966.8739 2969.2195 2970.5414 2973.4361 2979.2728 2987.6286 2995.6991 2999.5390 3006.6673 3011.6173 3012.5057 3018.2448 3022.0950 3027.8195 3030.5287 3034.4443 3037.3864 3048.5823 3052.0784 3065.2569 3065.8227 3067.9886 3457.5845 3495.4064 3593.2701
redmass: 3.8695 4.3077 4.1988 3.6633 4.6131 2.5882 2.9718 3.7434 3.8459 3.3063 2.6654 1.7816 2.3926 2.2198 2.2723 1.9709 2.3873 2.4604 2.7694 2.4865 2.1124 1.3566 1.1720 3.3545 2.5105 3.1262 2.5680 2.9525 2.5667 3.5251 3.0856 2.5711 2.8561 2.6767 2.7082 2.4924 2.3661 1.5919 2.8268 1.2973 1.5213 1.1463 1.3529 1.1909 1.6085 1.2775 1.4879 1.8243 1.2920 1.8073 1.8892 2.1835 1.7588 1.5092 1.6996 1.5812 1.6546 2.3293 1.5156 1.7827 1.7582 2.2298 3.7598 2.0457 2.3733 2.5505 1.7954 2.6623 2.4205 2.1177 1.8493 2.1488 1.8018 2.2844 1.9737 1.7322 1.7727 1.5957 1.6226 1.6025 1.3992 1.3778 1.3585 1.3333 1.3341 1.4170 1.3269 1.3935 1.2609 1.2071 1.0616 1.1909 1.1613 1.1167 1.1289 1.1873 1.2014 1.3037 1.3297 1.2085 1.4467 1.4652 1.4244 1.4615 1.6720 1.5854 1.5381 1.2164 1.7827 1.0850 1.0953 1.0687 1.0756 1.0806 1.0838 1.0815 1.0782 1.0946 1.0763 1.0552 1.0573 1.1007 1.0897 1.0945 1.3041 3.6765 6.6263 1.0591 1.0591 1.0600 1.0599 1.0595 1.0604 1.0616 1.0601 1.0601 1.0603 1.0578 1.0381 1.0605 1.0611 1.0959 1.0983 1.0959 1.0999 1.0991 1.1009 1.0990 1.0997 1.0942 1.1034 1.0971 1.0995 1.1036 1.1022 1.0934 1.0886 1.1001 1.0996 1.0447 1.0637 1.0981
irintensity: 0.0127 0.1294 0.0765 0.4687 2.3687 0.1716 0.0844 0.1977 0.1966 0.8670 0.5722 0.0292 0.0364 0.0359 0.0340 0.1086 0.2918 0.3616 0.2789 0.5068 7.6556 31.8712 9.8876 1.8899 2.4093 1.6315 10.1812 1.3074 0.9508 6.1246 2.8442 1.8465 1.4305 1.2514 21.3360 4.0871 6.9844 79.2302 10.3562 317.4465 35.2248 10.8759 9.3068 4.2976 8.8059 2.4211 2.8518 5.4203 0.9609 1.9599 0.9857 2.7895 2.2492 0.8918 6.0050 3.6388 3.5355 6.4350 65.1624 8.0580 0.6571 1.5906 1.6632 15.5096 3.2487 189.8901 28.6964 1.2961 0.3017 0.7988 2.3306 2.3324 0.7525 8.2012 2.7279 2.2987 2.5627 1.5130 11.0519 1.9277 0.3471 0.7869 4.8486 1.2835 4.3606 1.7276 0.6465 5.6283 0.4460 0.3951 0.1516 1.1420 0.3475 0.4564 0.2870 1.4791 3.7245 0.1038 0.3584 5.2304 0.5482 0.4142 2.3478 1.2167 0.3449 2.1116 0.9753 11.9906 8.6312 5.2293 13.5559 1.2571 0.3389 1.4626 9.7184 5.6836 0.1362 14.8940 0.6642 6.4957 7.2070 10.3284 2.0555 24.2178 153.4717 149.1031 0.0514 2.4640 1.2217 21.8176 14.3911 7.0416 4.7879 18.6928 20.0557 69.1115 21.4600 125.0750 34.7118 96.9445 74.5828 1.5792 0.2270 1.9268 9.2099 7.2363 10.7000 6.8189 19.4976 17.9801 3.4703 50.7657 27.9806 255.0306 126.2119 16.3913 64.2170 97.6586 65.5654 6.3833 18.5523 5.7843
temp: 298.150 k
press: 1.00000 atm
elementType: 8 8 7 6 6 6 6 6 6 6 6 6 6 6 6 6 6 6 6 6 6 1 1 1 1 1 1 1 1 1 1 1 1 1 1 1 1 1 1 1 1 1 1 1 1 1 1 1 1 1 1 1 1 1 1 1
symmnumber: 1
zpe: 1311116.6 jmol-1
zpe.correction: 0.499378 hartree
zpe.thermalcorrener: 0.525763 hartree
zpe.thermalcorrenthalpy: 0.526708 hartree
zpe.thermalcorrgfe: 0.438841 hartree
zpe.sumelectzpe: -910.372440 hartree
zpe.sumelectthermal: -910.346055 hartree
zpe.sumelectthermalent: -910.345111 hartree
zpe.sumelectthermalfe: -910.432977 hartree
dipole: 2.0582 0.3577 -0.2541
dipole: 2.1044
quadrupole: -146.9033 -136.1555 -124.2596
quadrupole: -4.7382 3.9630 0.9395
quadrupole: -11.1305 -0.3827 11.5132 -4.7382 3.9630 0.9395
hfenergy: -910.8718181 hartree
pointgroup: C01 [X(C18H35N1O2)]
dipole: 0.821121 0.0488751 -0.0941771 debye
polarizability: 230.3310419|-4.1053742|214.9451679|-1.1657791|9.6090036|183.3416178 unknown
InChI: InChI=1S/C18H35NO2/c1-2-3-4-5-6-7-8-9-10-11-12-13-14-15-16-17(19)18(20)21/h9-10,17,20H,2-8,11-16,19H2,1H3
charge 0 multiplicity 1
56 atoms
O  -3.308994 -0.981167 -1.361439
O  -4.094823 -2.731312 -0.056603
N  -3.292794 -1.180076 2.181843
C  1.161102 -2.283407 -0.102724
C  2.035543 -2.080033 -1.36128
C  -0.271777 -1.734479 -0.289707
C  0.374134 2.903264 0.460157
C  1.739158 2.359454 -0.019436
C  3.474223 -2.638489 -1.247016
C  -0.76724 2.682095 -0.558541
C  2.8879 2.633402 0.977035
C  -1.143164 -1.873345 0.978844
C  -2.15579 3.112998 -0.034665
C  4.336563 -1.985089 -0.127106
C  4.221486 1.925316 0.604774
C  -2.51374 -1.112373 0.932067
C  -3.294088 2.877856 -1.054351
C  4.44476 -0.478863 -0.260033
C  4.133853 0.415926 0.714495
C  -4.680247 3.288174 -0.511756
C  -3.389667 -1.703386 -0.166645
H  1.63012 -1.771655 0.761703
H  1.118708 -3.363024 0.152807
H  2.086507 -0.994856 -1.585543
H  1.534248 -2.55671 -2.228986
H  -0.211495 -0.664353 -0.578402
H  -0.754979 -2.253026 -1.141764
H  0.462444 3.987667 0.682329
H  0.107444 2.413103 1.420783
H  1.992452 2.807451 -1.003197
H  1.658487 1.266033 -0.188993
H  3.989195 -2.494943 -2.219259
H  3.435667 -3.733125 -1.071411
H  -0.537685 3.236176 -1.492673
H  -0.804529 1.60856 -0.841323
H  2.578425 2.302342 1.991109
H  3.062039 3.72641 1.046934
H  -0.588058 -1.461426 1.847063
H  -1.341983 -2.941237 1.200553
H  -2.386026 2.556405 0.89916
H  -2.128192 4.187039 0.246197
H  5.34974 -2.437598 -0.171474
H  3.925198 -2.239203 0.868917
H  5.014855 2.296916 1.287499
H  4.525988 2.211454 -0.421746
H  -2.314461 -0.055661 0.677664
H  -3.309517 1.806224 -1.338136
H  -3.073285 3.446317 -1.981376
H  4.795122 -0.101886 -1.235551
H  3.778234 0.031636 1.686243
H  -4.698532 4.359381 -0.233833
H  -4.939528 2.70237 0.390358
H  -5.4754 3.120441 -1.261738
H  -2.776823 -0.871044 3.010151
H  -3.768363 -2.079489 2.312395
H  -3.874814 -1.424556 -2.052175
