program: Gaussian 09
title: 000171401
version: EM64L-G09RevD.01
frameworkgroup: C1[X(C5H10S)]
method: RPBEPBE
basis: SDD
operation: Freq
keyword: #pfreq=noraman
keyword: PBEPBE/SDD
title: #p freq=noraman PBEPBE/SDD
converged: YES YES NO NO
title: Mulliken charges:
elementType: S C C C C C H H H H H H H H H H
charge: 0.129477 -0.070231 -0.362386 -0.676819 -0.660361 -0.673620 0.227987 0.229696 0.260525 0.260724 0.228060 0.205215 0.236857 0.234911 0.207524 0.222440
chargesum: 0.00000
title: Mulliken charges with hydrogens summed into heavy atoms:
elementType: S C C C C C
charge: 0.129477 -0.070231 0.095297 -0.155569 0.009771 -0.008745
polarizability: 7.85872045e+01 5.84663104e-01 6.89178121e+01 1.95626222e-01 -1.37747543e+00 5.76249925e+01
1716.lowfreq: -25.5763 -20.4769 -14.9674 0.0011 0.0038 0.0038 79.4687 208.9832 251.5350
frequency: 79.3134 208.9398 251.5237 257.9693 313.6491 347.3939 371.0136 505.3857 536.6134 659.5877 762.3395 851.4669 914.0314 938.5632 957.9651 987.2674 995.6708 1049.9605 1118.3564 1183.8501 1211.0477 1233.5192 1258.1524 1295.4029 1377.7163 1393.1234 1447.5577 1455.7304 1459.8472 1465.2538 1467.9785 1479.6829 2963.1167 2967.8655 3003.4338 3044.6013 3057.0542 3063.2269 3070.4720 3089.1070 3092.9439 3124.2218
redmass: 2.1501 1.1760 1.2020 1.8278 2.5211 2.4923 2.2743 4.9180 3.5677 4.5697 1.5506 1.9664 1.4962 1.3064 1.9338 1.3599 1.9597 1.2718 1.8417 1.4594 1.5718 2.0065 1.9575 1.5838 1.2425 1.2096 1.0588 1.0702 1.0516 1.0975 1.0588 1.0535 1.0387 1.0385 1.0597 1.0575 1.0955 1.0949 1.1046 1.1003 1.0996 1.1111
irintensity: 0.6626 0.3582 0.7455 0.4450 1.4757 2.0721 0.2068 3.5012 8.1011 3.7780 3.2462 2.3605 0.6941 1.1750 1.2021 0.3963 2.3942 0.8611 44.5004 1.4981 2.5865 3.7688 20.7012 22.5838 27.8141 8.4043 2.6863 4.1499 11.7023 1.7227 12.0677 12.3480 19.8431 42.5853 44.5163 44.4805 8.8093 43.8407 12.2214 22.0009 33.2664 27.4226
temp: 298.150 k
press: 1.00000 atm
elementType: 16 6 6 6 6 6 1 1 1 1 1 1 1 1 1 1
symmnumber: 1
zpe: 360745.4 jmol-1
zpe.correction: 0.137401 hartree
zpe.thermalcorrener: 0.144719 hartree
zpe.thermalcorrenthalpy: 0.145663 hartree
zpe.thermalcorrgfe: 0.106286 hartree
zpe.sumelectzpe: -594.077318 hartree
zpe.sumelectthermal: -594.070000 hartree
zpe.sumelectthermalent: -594.069055 hartree
zpe.sumelectthermalfe: -594.108432 hartree
dipole: 0.9610 2.0357 -0.4320
dipole: 2.2923
quadrupole: -43.8592 -46.8191 -45.8114
quadrupole: -2.7173 0.5677 0.2321
quadrupole: 1.6374 -1.3226 -0.3148 -2.7173 0.5677 0.2321
hfenergy: -594.2147183 hartree
pointgroup: C01 [X(C5H10S1)]
dipole: 0.2064871 0.2900521 -0.8285902 debye
dipolederiv: -0.4212271 -0.0457307 0.0684319 -0.0666682 -0.2363144 0.0542524 0.1383058 0.0789007 -0.3522958 0.4920321 0.0463278 -0.1704536 0.1155851 0.2696308 -0.035771 -0.3144406 -0.0367535 0.2378281 -0.1877882 0.0118752 -0.002039 0.0066156 0.110535 0.0087506 -0.0562795 -0.0479208 0.0497585 0.1935605 0.0047854 0.0901196 -0.0548368 0.1439919 -0.0207934 0.2320701 -0.005197 0.1247864 -0.0290876 -0.0325508 -0.0122805 -0.0194182 -0.1180388 -0.0614654 0.0441539 -0.0087905 0.0056543 -0.0809056 0.0762093 0.0120758 0.021836 -0.0693147 -0.0006535 0.0723965 -0.0392053 0.0221572 0.0719936 0.0023843 0.0215987 -0.0018224 -0.0786975 -0.1413588 0.0157799 -0.0829649 -0.0209106 0.0860734 -0.0133374 0.0292114 -0.001877 -0.0671114 0.1661798 0.0221699 0.1071013 -0.0540458 -0.0013862 0.0773562 -0.0098221 0.1443732 -0.1052607 -0.0009258 -0.0442462 0.0128542 0.020514 -0.0830143 -0.0734055 -0.0622972 -0.1086748 0.0194754 -0.0213993 -0.1024026 -0.029368 0.0271154 0.0111107 -0.0267011 -0.1102768 0.007564 0.0814024 0.0345168 -0.1342129 -0.0172865 -0.0586906 -0.026788 -0.0870197 0.1104617 -0.0930096 0.0263574 0.0440828 0.1335298 0.0723563 -0.0572537 -0.0317182 0.1443876 0.0231548 0.0881986 -0.0283622 -0.0164062 0.0078971 -0.015875 0.0936811 0.0563293 -0.1036848 -0.0213506 -0.0398087 -0.1046027 -0.054242 -0.0175109 -0.0505814 0.0834979 -0.0418238 -0.0047536 0.1191791 -0.016614 0.0608578 0.0641215 0.1499871 0.0410011 -0.0621829 -0.0073607 0.0238578 -0.0857131 0.0185573 0.0954519 -0.0188884 -0.1471974 0.0217294 -0.0596134 unknown
polarizability: 77.9630143|1.5177843|59.5404603|-1.9458218|-4.5816161|67.6265346 unknown
InChI: InChI=1S/C5H10S/c1-5(2)3-4-6-5/h3-4H2,1-2H3
charge 0 multiplicity 1
16 atoms
S  -0.803013 -0.48681 1.347514
C  0.513253 0.058002 -0.012116
C  -0.607815 0.089235 -1.106954
C  -1.845918 0.067876 -0.169965
C  1.076003 1.445822 0.325381
C  1.611302 -0.988172 -0.218472
H  -0.566437 -0.82336 -1.727405
H  -0.550222 0.967379 -1.775345
H  -2.290134 1.057107 0.018846
H  -2.628493 -0.661713 -0.424288
H  1.684435 1.412452 1.246681
H  1.721969 1.805687 -0.501481
H  0.266151 2.179691 0.480691
H  1.181287 -1.986299 -0.408084
H  2.244881 -0.707327 -1.084309
H  2.266351 -1.057869 0.669406
