program: Gaussian 09
title: 000171341
version: EM64L-G09RevD.01
frameworkgroup: C1[X(C9H12O5)]
method: RPBEPBE
basis: SDD
operation: Freq
keyword: #pfreq=noraman
keyword: PBEPBE/SDD
title: #p freq=noraman PBEPBE/SDD
converged: YES YES NO NO
title: Mulliken charges:
elementType: O O O O O C C C C C C C C C H H H H H H H H H H H H
charge: -0.272412 -0.407822 -0.419265 -0.237791 -0.227479 0.387158 -0.199877 -0.266205 -0.191684 -0.516699 -0.444381 -0.774965 0.132051 0.139617 0.285943 0.320947 0.292699 0.233195 0.240398 0.239527 0.225349 0.227395 0.232446 0.236362 0.379550 0.385943
chargesum: 0.00000
title: Mulliken charges with hydrogens summed into heavy atoms:
elementType: O O O O O C C C C C C C C C
charge: -0.272412 -0.028272 -0.033322 -0.237791 -0.227479 0.387158 0.086067 0.054742 0.101014 -0.043106 0.020496 -0.078762 0.132051 0.139617
polarizability: 1.12990741e+02 -5.88053083e+00 1.06812053e+02 -2.56918303e+00 4.58562970e+00 9.52463641e+01
1716.lowfreq: -8.1600 0.0006 0.0009 0.0010 10.3078 11.7623 31.6236 45.8137 60.0526
frequency: 31.5901 45.7566 59.9945 124.0920 139.3891 170.7783 189.4400 225.4893 281.1846 308.6421 325.3304 348.1091 396.1976 470.4070 486.7318 526.1623 571.8132 576.6281 614.1941 621.3514 637.8527 673.5875 685.5979 759.4234 790.3678 808.9980 823.7528 872.4874 907.5776 915.8861 922.4684 960.8690 966.6024 1011.0964 1012.8718 1036.9565 1075.6519 1080.5521 1106.9228 1124.7784 1156.9805 1178.2633 1200.5237 1215.8549 1232.3594 1237.8162 1253.2321 1275.6278 1282.9972 1294.9821 1317.6597 1323.9614 1364.9189 1398.7704 1460.9247 1466.2519 1473.0156 1481.9086 1649.7603 1657.7601 2997.5594 2999.1482 3022.6523 3035.0188 3078.1101 3079.9235 3096.3502 3099.3814 3102.2293 3134.7460 3507.3349 3514.1040
redmass: 7.5795 6.1441 7.9253 5.8437 5.0432 2.0656 1.4665 2.0053 5.0852 2.7711 3.7388 7.9361 3.8380 3.3320 3.3918 3.7962 2.6352 3.5592 1.9915 3.8906 1.7941 2.4757 3.3144 3.9378 4.6682 3.3998 1.7168 3.8493 3.0178 2.8012 2.7313 4.0337 2.9961 2.3144 2.0127 2.1756 2.2211 1.8923 1.8328 1.6309 1.4432 1.4644 1.5880 1.2490 1.4876 1.4116 1.4969 1.4359 1.6569 1.7732 1.9527 2.1912 2.0034 1.2834 1.0675 1.0691 1.0485 1.0978 8.2716 9.4087 1.0361 1.0820 1.0586 1.0622 1.0872 1.1028 1.1000 1.1006 1.1037 1.0916 1.0639 1.0640
irintensity: 1.5531 0.5615 1.0700 0.8851 2.0100 0.1413 0.3275 0.1273 4.3957 3.2421 3.1719 2.8535 2.5339 20.4653 5.4454 24.7559 64.2643 47.3391 81.7969 11.2513 74.1323 79.1734 19.9487 20.3723 8.6218 5.4544 27.4014 17.5057 30.6524 1.9533 9.8162 4.2965 19.6988 69.7746 8.5830 113.9858 83.4351 243.3578 36.6981 10.9313 11.0050 22.3095 45.0297 0.9436 2.5246 3.3387 0.7762 5.1184 14.0788 17.3097 18.1571 32.2683 52.0973 26.0196 4.5146 5.4476 8.6371 20.8381 195.8467 242.5993 15.0425 10.9392 29.8341 29.4069 1.8061 0.3228 15.4445 4.5449 47.8807 8.3325 29.5206 26.2770
temp: 298.150 k
press: 1.00000 atm
elementType: 8 8 8 8 8 6 6 6 6 6 6 6 6 6 1 1 1 1 1 1 1 1 1 1 1 1
symmnumber: 1
zpe: 533999.3 jmol-1
zpe.correction: 0.203390 hartree
zpe.thermalcorrener: 0.216486 hartree
zpe.thermalcorrenthalpy: 0.217430 hartree
zpe.thermalcorrgfe: 0.162950 hartree
zpe.sumelectzpe: -725.213300 hartree
zpe.sumelectthermal: -725.200204 hartree
zpe.sumelectthermalent: -725.199260 hartree
zpe.sumelectthermalfe: -725.253740 hartree
dipole: -2.2492 1.4743 0.1129
dipole: 2.6917
quadrupole: -79.3683 -78.5830 -85.1734
quadrupole: 4.6518 0.9337 6.6800
quadrupole: 1.6733 2.4586 -4.1319 4.6518 0.9337 6.6800
hfenergy: -725.41669 hartree
pointgroup: C01 [X(C9H12O5)]
dipole: -0.8927901 -0.5541179 -0.1318505 debye
dipolederiv: -0.6410992 -0.0373492 -0.0515605 -0.0369135 -0.6358395 -0.0079101 -0.0792265 0.0012625 -0.564626 -0.6859585 -0.2894952 -0.3772768 -0.261645 -0.6232168 -0.3489383 -0.3308219 -0.341849 -0.5903189 -0.340443 0.1229556 0.0315241 0.0973824 -1.0026166 -0.3450459 0.0362696 -0.3837119 -0.5815192 -0.4721138 -0.2329854 0.0483862 -0.1360928 -0.5596731 0.2045424 -0.1408262 0.1212299 -0.8921333 -0.9823384 -0.2732199 -0.0943619 -0.06628 -0.6108275 -0.1584349 0.0904228 -0.1262616 -0.3839066 0.4565756 -0.1612421 0.1189029 0.0350207 0.6835723 -0.0087981 0.0147705 -0.0240726 0.4175828 0.295257 -0.0521012 -0.0233693 -0.2011361 0.4177612 0.0229163 0.0883739 0.0947486 0.3837177 -0.0878841 -0.0005271 -0.0343578 -0.08829 -0.4348093 0.1205388 0.0704938 0.1843545 -0.093169 -0.2159484 0.0527156 0.0762647 0.0574201 -0.1445775 -0.0233827 0.2340716 -0.0975849 -0.0355485 -0.000146 0.0010335 -0.0168031 -0.0068092 0.0239929 -0.1015637 0.0305049 -0.0641783 -0.1341936 -0.0917958 0.0272797 0.0825776 0.0657103 0.1046455 -0.0317177 0.0094746 -0.0174642 -0.0072287 -0.0321617 0.0098088 -0.0635692 0.022679 -0.0061504 0.0170271 -0.0890862 -0.0277716 -0.0722907 0.7480402 0.7764641 0.2241739 0.5686758 0.9537423 -0.0264462 0.3098035 -0.0484974 1.2414191 1.3458111 0.1137838 -0.0748057 0.0233531 1.1312167 0.513388 -0.3140453 0.559339 0.5224579 -0.0183083 -0.0686462 -0.0346908 -0.0581625 0.0457073 -0.0106003 -0.004749 0.0015908 0.0644045 0.0893909 -0.0274155 0.027247 -0.0300185 0.0687716 -0.0275877 0.0205835 -0.0482345 -0.0079379 0.0914827 0.0382891 0.0158659 0.0849029 0.0991694 0.0422864 -0.0637675 0.0300228 0.0166073 0.0035308 -0.0783652 0.0185483 -0.1147783 -0.0079462 0.0657617 0.0493257 0.0480629 0.0337465 -0.0458303 0.092302 -0.0244468 0.1255352 -0.0584602 0.0135419 -0.0505431 0.0232072 0.0746654 0.0441268 0.0200268 -0.0048822 0.0073428 -0.1427809 -0.0991558 0.003277 -0.0404583 0.0560952 0.0722231 0.009296 -0.0256732 0.0138267 0.0423114 0.1188207 -0.0420433 0.0502725 -0.0913939 0.0510877 0.0823524 -0.025356 0.1120789 -0.0976314 0.047247 -0.023998 0.0023664 0.0740454 0.0261357 0.026231 0.1159699 0.0336469 0.0914013 -0.0498683 0.0493273 -0.0422546 -0.0712655 -0.0130959 -0.0912501 -0.0008495 -0.1155421 0.0273509 -0.0048094 0.0259911 0.0278092 0.0853831 0.3171418 -0.0582353 0.0426696 -0.0694043 0.2890487 0.087817 0.0764102 0.1472815 0.2001933 0.0863201 -0.0017058 0.0498727 -0.0625023 0.345838 -0.0096284 0.0300067 -0.0292089 0.3552134 unknown
polarizability: 112.9847183|5.2506964|105.5582591|3.8183767|5.7521996|96.5061805 unknown
InChI: InChI=1S/C9H12O5/c1-9-3-2-4(14-9)5(7(10)11)6(9)8(12)13/h4-6,10,12H,2-3H2,1H3
charge 0 multiplicity 1
26 atoms
O  0.096378 1.78289 -0.71593
O  -1.941677 -2.240894 -0.652893
O  2.27008 -1.619997 -0.788019
O  -1.123736 -1.929808 1.494314
O  3.344178 0.231901 0.10281
C  -1.071762 0.854377 -0.572889
C  0.713179 1.472083 0.608385
C  -0.289503 -0.519138 -0.361978
C  0.928193 -0.069933 0.508924
C  -1.697197 1.321938 0.777333
C  -0.44008 1.775027 1.599984
C  -1.949467 0.92239 -1.810541
C  -1.112539 -1.608514 0.283182
C  2.290374 -0.418473 -0.065184
H  1.637062 2.052382 0.723919
H  0.03204 -0.868784 -1.355306
H  0.874673 -0.546147 1.508564
H  -2.268828 0.525538 1.282431
H  -2.379847 2.167277 0.589283
H  -0.475581 2.854842 1.818189
H  -0.332951 1.229739 2.553228
H  -2.383992 1.931623 -1.914549
H  -1.360153 0.701926 -2.71737
H  -2.769262 0.186737 -1.746865
H  -2.478173 -2.942244 -0.191812
H  3.191589 -1.827437 -1.10301
