program: Gaussian 09
title: 000171344
version: EM64L-G09RevD.01
frameworkgroup: C1[X(C15H19NO)]
method: RPBEPBE
basis: SDD
operation: Freq
keyword: #p
keyword: freq=noraman
keyword: PBEPBE/SDD
title: #p freq=noraman PBEPBE/SDD
converged: NO YES NO NO
title: Mulliken charges:
elementType: O N C C C C C C C C C C C C C C C H H H H H H H H H H H H H H H H H H H
charge: -0.287867 -0.223859 -0.225139 -0.426578 -0.426581 -0.463778 -0.463774 0.449880 -0.572216 0.317243 0.155787 -0.629626 -0.583735 0.337520 0.371369 -0.826635 -0.820573 0.227354 0.207388 0.219850 0.219850 0.207388 0.224323 0.204491 0.204488 0.224326 0.250170 0.267436 0.247579 0.254609 0.223413 0.223441 0.231134 0.224894 0.231561 0.224867
chargesum: 0.00000
title: Mulliken charges with hydrogens summed into heavy atoms:
elementType: O N C C C C C C C C C C C C C C C
charge: -0.287867 0.026311 0.002215 0.000660 0.000658 -0.034964 -0.034961 0.449880 -0.304781 0.317243 0.155787 -0.382046 -0.329125 0.337520 0.371369 -0.148647 -0.139250
polarizability: 2.60180385e+02 4.59530827e+00 1.57322888e+02 6.41073846e-04 -7.36724661e-04 1.11929477e+02
1716.lowfreq: -11.6367 -10.4276 0.0004 0.0005 0.0007 2.8154 32.7596 47.5260 51.7759
frequency: 32.7562 47.5219 51.6550 120.3843 134.6707 143.1971 166.8753 180.9998 218.4758 225.4878 281.0544 293.8021 304.4322 323.1794 351.4123 400.1638 419.8120 440.3846 454.8562 456.1784 493.7147 538.6372 563.6070 640.3468 652.8084 660.6664 723.8492 744.2095 747.4821 763.2548 796.9671 804.7152 823.2317 854.1529 868.6854 885.3447 885.9160 895.3000 908.8475 954.7526 991.9810 998.5414 1002.0874 1008.7686 1029.4978 1051.2760 1070.9655 1082.5088 1102.2056 1120.8199 1144.9515 1150.2870 1170.4322 1181.9900 1226.8004 1231.8644 1248.8639 1255.3118 1283.5136 1290.2671 1305.4502 1316.9585 1321.6241 1334.2554 1341.6265 1358.1617 1389.3505 1391.6501 1405.9803 1428.8303 1440.2324 1450.0839 1454.1981 1458.9847 1460.8026 1461.2322 1465.7816 1476.4110 1483.0604 1485.1448 1585.8696 1595.8630 1638.0842 2966.2332 2967.9448 2968.7502 2970.7679 2975.0183 2980.6028 2983.3586 3036.6333 3039.0738 3040.4680 3043.5191 3050.2995 3054.7331 3080.5240 3083.6358 3133.9100 3154.4951 3217.9767 3419.9363
redmass: 3.4681 3.6666 4.1492 1.1821 3.0490 2.4383 3.1834 1.1616 1.7373 5.1208 3.9926 2.4941 2.3879 3.7780 2.1024 4.4578 3.2950 2.9152 5.6736 3.0988 2.6375 1.9394 3.3439 4.1937 1.8840 4.7405 5.2553 3.7351 3.3270 5.3007 1.5253 2.8821 1.3665 3.0842 1.3717 3.9626 1.4892 1.9201 2.5269 1.5932 2.0867 1.3954 1.6545 2.5440 1.4380 1.6249 3.7304 2.0784 1.6000 1.7132 1.7272 2.9396 2.3606 2.6816 1.3010 3.1233 1.2955 1.3561 1.6615 1.2780 7.4566 1.2688 1.2685 1.2659 1.3347 1.3679 3.5703 1.2577 1.3614 2.6642 1.1164 1.0815 1.0989 1.1346 1.0472 1.0896 2.1180 1.0457 1.1429 1.7325 8.3480 7.5968 7.7997 1.0377 1.0380 1.0636 1.0663 1.0803 1.0593 1.0624 1.0970 1.0989 1.0969 1.0989 1.1035 1.1031 1.0982 1.0975 1.0920 1.0926 1.0981 1.0743
irintensity: 0.3771 0.2037 0.6656 0.0356 3.0872 0.4492 8.0659 0.0871 0.0151 0.3084 0.0101 0.7084 3.1536 0.8026 10.8921 5.7907 9.2701 5.5642 0.4922 0.0295 1.4795 5.3064 0.0383 0.1025 192.5952 3.3548 8.1901 16.3624 1.9707 1.0088 0.3834 5.9553 14.0754 4.8264 29.4132 15.7558 24.0162 0.5449 6.7307 8.8869 12.5095 30.1846 0.8001 22.1426 17.0112 0.0609 19.1797 0.8786 2.5222 24.5325 16.8400 17.7697 10.6866 3.0778 9.4152 5.2183 4.7224 1.5162 2.5001 1.2718 15.6302 0.4435 3.3737 2.2406 19.9145 0.8503 0.7502 6.9788 18.9200 4.2383 9.0165 12.8584 11.9202 0.1573 0.4087 14.0614 55.3617 30.0461 0.0995 20.4620 10.6205 21.7076 3.8615 64.5748 39.7587 33.6399 51.9425 32.1683 40.6314 6.5960 40.8852 77.9429 4.7238 7.9784 2.6902 92.6338 39.4030 5.9760 16.3912 4.7729 6.0304 2.1028
temp: 298.150 k
press: 1.00000 atm
elementType: 8 7 6 6 6 6 6 6 6 6 6 6 6 6 6 6 6 1 1 1 1 1 1 1 1 1 1 1 1 1 1 1 1 1 1 1
symmnumber: 1
zpe: 802181.3 jmol-1
zpe.correction: 0.305535 hartree
zpe.thermalcorrener: 0.321259 hartree
zpe.thermalcorrenthalpy: 0.322203 hartree
zpe.thermalcorrgfe: 0.262255 hartree
zpe.sumelectzpe: -711.705275 hartree
zpe.sumelectthermal: -711.689550 hartree
zpe.sumelectthermalent: -711.688606 hartree
zpe.sumelectthermalfe: -711.748554 hartree
dipole: 1.5561 -0.2901 0.0001
dipole: 1.5829
quadrupole: -103.4151 -93.4273 -103.2763
quadrupole: 1.2295 0.0005 -0.0001
quadrupole: -3.3755 6.6123 -3.2367 1.2295 0.0005 -0.0001
hfenergy: -712.0108093 hartree
pointgroup: C01 [X(C15H19N1O1)]
dipole: 0.6127912 0.1109835 -0.0000222 debye
polarizability: 260.1301893|-5.126128|157.3730713|-0.0127605|0.0230789|111.9294898 unknown
InChI: InChI=1S/C15H19NO/c1-10-7-13-9-15(12-3-5-16-6-4-12)17-14(13)8-11(10)2/h7-9,12,16H,3-6H2,1-2H3
charge 0 multiplicity 1
36 atoms
O  -0.31494 -0.694409 -0.000344
N  -5.141436 -0.715901 -0.0001
C  -2.444315 0.580859 0.00045
C  -3.027164 -0.101451 1.276355
C  -3.027302 -0.100089 -1.276117
C  -4.578959 -0.107289 1.231093
C  -4.579091 -0.105932 -1.230686
C  -0.945162 0.591605 0.000375
C  0.007091 1.593072 0.000833
C  1.316491 0.957757 0.000433
C  1.07558 -0.443402 -0.000297
C  2.660886 1.403848 0.000591
C  2.091102 -1.40664 -0.000877
C  3.715409 0.462393 0.000011
C  3.431904 -0.950288 -0.000723
C  5.156725 0.943344 0.000083
C  4.56763 -1.958384 -0.001343
H  -2.769356 1.642066 0.001025
H  -2.671915 0.429072 2.181396
H  -2.647179 -1.140139 1.333409
H  -2.647347 -1.138725 -1.334317
H  -2.672135 0.431387 -2.180629
H  -4.98693 -0.643587 2.107428
H  -4.949413 0.936816 1.286767
H  -4.949513 0.93825 -1.285137
H  -4.987187 -0.641238 -2.107568
H  -5.013546 -1.738751 -0.000672
H  -0.203995 2.661044 0.001404
H  2.891442 2.475063 0.001148
H  1.858659 -2.475819 -0.001439
H  5.710093 0.579291 0.887392
H  5.7095 0.581203 -0.888388
H  5.209756 2.045341 0.001241
H  5.218583 -1.841134 0.886747
H  4.184165 -2.99265 -0.002394
H  5.219066 -1.839484 -0.88885
