program: Gaussian 09
title: 000171336
version: EM64L-G09RevD.01
frameworkgroup: C1[X(C8H12N2O3S)]
method: RPBEPBE
basis: SDD
operation: Freq
keyword: #p
keyword: freq=noraman
keyword: PBEPBE/SDD
title: #p freq=noraman PBEPBE/SDD
converged: YES YES NO NO
title: Mulliken charges:
elementType: S O O O N N C C C C C C C C H H H H H H H H H H H H
charge: 0.240767 -0.216930 -0.323748 -0.235177 0.096017 -0.367603 -0.025987 -0.257718 -0.669760 -0.526163 -0.462410 0.313459 -0.015942 -0.537248 0.275926 0.251786 0.242292 0.222418 0.259835 0.274565 0.227812 0.249882 0.323390 0.215029 0.218027 0.227484
chargesum: 0.00000
title: Mulliken charges with hydrogens summed into heavy atoms:
elementType: S O O O N N C C C C C C C C
charge: 0.240767 -0.216930 -0.323748 -0.235177 0.096017 -0.044213 0.249938 -0.257718 0.046736 0.008238 0.015284 0.313459 0.199087 -0.091738
polarizability: 1.89292061e+02 -1.14372150e+01 1.25510341e+02 -3.53513962e+00 8.89786259e+00 8.67533385e+01
1716.lowfreq: -15.8890 -2.9533 -0.0020 -0.0004 0.0011 6.1514 17.7171 29.8521 43.4358
frequency: 16.2592 29.5246 43.4341 53.6125 67.7997 78.6291 110.3977 174.5925 190.9307 204.4029 225.4943 237.2337 295.2319 331.5613 350.5672 397.6804 433.8372 467.3522 512.9859 530.4574 542.8829 577.4569 603.0164 655.7896 666.5989 689.7345 722.1344 802.7329 840.8559 870.2833 915.8370 927.1121 944.3389 960.2023 969.7695 999.2084 1008.8221 1048.5845 1050.5294 1095.6488 1141.9110 1147.9747 1174.1801 1176.4662 1264.3387 1268.4601 1284.5208 1289.5770 1312.5959 1346.1308 1380.9528 1430.1661 1449.4011 1452.4952 1464.8327 1475.3007 1477.9432 1580.8315 1660.5239 1727.4900 2994.8757 2997.8942 3020.4291 3077.3214 3077.9296 3089.7360 3101.3250 3105.0393 3105.7571 3140.8565 3201.8404 3568.3668
redmass: 4.0075 5.3049 5.4506 4.4791 4.2759 4.0106 3.4812 4.1297 5.2875 2.2535 1.2328 4.4130 4.7905 4.0604 2.7541 2.7194 3.1067 6.8854 6.3609 1.1994 6.8039 5.3489 5.5757 2.3403 3.8680 6.8315 4.8189 3.2554 3.6271 7.7494 1.8478 1.5565 2.1352 1.4284 1.9917 1.2185 2.3291 4.8722 3.2752 2.0933 2.8828 2.1859 2.0410 1.3104 1.2252 1.3888 1.2182 1.2389 1.1962 1.2152 1.2034 1.1744 1.1245 1.0779 1.0498 1.0570 1.6256 11.7684 4.6652 10.4463 1.0353 1.0643 1.0599 1.0917 1.0901 1.0694 1.0973 1.0913 1.1008 1.1068 1.1151 1.0775
irintensity: 1.5589 1.9108 4.6227 1.3200 2.0330 0.8950 0.1549 0.5513 0.0768 5.5505 0.9941 2.5529 21.6541 0.4863 0.1880 2.3991 6.2561 1.0790 1.8643 131.3020 25.8180 50.8769 24.2044 2.1793 34.8730 22.8128 8.3824 9.4338 162.5493 389.4715 27.6552 8.7174 2.0801 37.2926 124.9757 11.2462 59.4148 139.9007 75.9759 3.1826 32.5961 8.6262 228.1653 56.9878 68.3542 3.3113 17.1716 1.4160 1.2498 1.2660 23.8444 9.1539 39.0830 0.9237 10.1345 13.3250 366.4211 70.5851 5.8546 228.7676 8.4765 43.1292 56.5743 0.9895 0.4330 15.7284 20.5548 12.9869 17.9288 10.2943 23.4277 29.3192
temp: 298.150 k
press: 1.00000 atm
elementType: 16 8 8 8 7 7 6 6 6 6 6 6 6 6 1 1 1 1 1 1 1 1 1 1 1 1
symmnumber: 1
zpe: 518168.4 jmol-1
zpe.correction: 0.197360 hartree
zpe.thermalcorrener: 0.212924 hartree
zpe.thermalcorrenthalpy: 0.213868 hartree
zpe.thermalcorrgfe: 0.151277 hartree
zpe.sumelectzpe: -1044.125565 hartree
zpe.sumelectthermal: -1044.110001 hartree
zpe.sumelectthermalent: -1044.109057 hartree
zpe.sumelectthermalfe: -1044.171648 hartree
dipole: 0.8995 -2.8720 -2.0098
dipole: 3.6190
quadrupole: -71.3973 -88.4110 -90.0298
quadrupole: 6.7780 -3.1076 0.4600
quadrupole: 11.8821 -5.1317 -6.7504 6.7780 -3.1076 0.4600
hfenergy: -1044.3229248 hartree
pointgroup: C01 [X(C8H12N2O3S1)]
dipole: -0.3143203 1.2000654 -0.6987729 debye
dipolederiv: -0.3566067 0.0053208 0.0373485 0.4540269 -0.4883817 -0.0051621 -0.022164 0.1037942 -0.0453427 -0.6799837 0.069725 0.0601363 -0.2442968 -0.7700916 0.0103713 0.082254 -0.0112795 -0.4153883 -2.3188329 0.2509656 0.1429776 -0.2008775 -0.3120113 0.0419714 0.3781115 -0.0036888 -0.1943313 -0.8091274 0.1371728 0.0209978 0.1798265 -0.9628637 0.0547693 0.0576033 0.0933053 -0.327615 0.4066064 0.159934 -0.0848161 1.0781432 -0.4391265 -0.0710908 -0.2571216 0.0083715 -0.0602038 -1.5081496 -0.2031797 -0.0305923 -0.5807867 -0.5078016 0.0105373 0.2245026 0.1195922 -0.6036054 0.4576578 -0.0226936 -0.0103383 0.1197792 0.4265419 0.1333506 -0.0256102 0.2036357 0.3866199 0.2292952 -0.3612764 0.0239431 -0.8702593 0.7720311 -0.0182976 0.0633978 -0.1403077 -0.0963858 -0.0927901 -0.0210385 -0.0528696 -0.0097507 -0.0558402 -0.1057269 0.0454002 -0.1022615 -0.1106475 0.8578172 0.0909435 -0.0070269 0.2262241 0.5207627 -0.0813559 -0.0905354 -0.1407151 0.3627488 0.8989705 0.0331133 0.046627 -0.1374798 0.0832497 0.0358411 0.0164101 -0.0891891 0.3489166 2.9703387 -0.1152755 -0.2222659 -0.1274153 1.4670718 -0.1160658 -0.4461745 -0.2042077 0.3593279 -0.2334089 -0.0553494 0.1771049 0.046184 0.1340603 0.0646026 0.2041995 0.0852928 -0.0424547 -0.3461315 0.0083048 0.126611 -0.025716 0.0292467 0.1037991 0.0867393 0.0804525 -0.0892623 0.0607398 0.0201645 -0.0160352 0.0136097 -0.0119671 0.0428644 -0.023341 0.0476497 -0.015347 0.0330948 0.1041715 0.0360711 0.0779327 0.016376 -0.0475769 0.0274669 -0.0406558 0.0854511 -0.0987793 -0.122451 0.0159541 -0.1135299 0.0512347 0.0058958 0.0137384 0.0048338 0.0689039 0.0932837 -0.0017174 -0.0322908 0.0423942 -0.0187651 0.1324779 -0.0221863 0.0742359 -0.0185431 -0.1320466 -0.0155723 -0.0628689 -0.0544707 0.0356029 -0.0132244 -0.0933886 0.0608402 -0.1080327 -0.0112984 0.0560855 0.0314584 0.0375194 -0.0140296 -0.0514851 0.0536063 -0.0703175 0.0547444 -0.0788488 -0.0191938 0.0038694 -0.0693936 0.0402279 0.1269927 0.0364302 0.0996337 -0.0821036 0.0570363 -0.0080559 -0.0182469 0.0682953 -0.04244 -0.0835934 -0.0446165 -0.005101 0.0859367 0.1692298 -0.0031958 0.030592 0.0815875 0.1531155 0.0182008 0.0275089 -0.00008 0.361603 0.150924 0.0311046 -0.0421952 -0.0038638 -0.1188067 -0.0786408 -0.0854539 -0.0486021 0.0412767 0.1102939 -0.0058217 -0.1294968 0.0030212 0.079217 -0.053087 -0.171961 -0.0461315 -0.0315056 0.170716 -0.0121849 -0.0446482 0.0092962 -0.0666134 -0.0563674 -0.0348157 -0.0791002 0.0852399 unknown
polarizability: 188.4655934|-13.6706102|127.4956596|2.5735957|-5.8126011|85.5944883 unknown
InChI: InChI=1S/C8H12N2O3S/c1-3-4-9-8(11)13-10-7-6(2)12-5-14-7/h3,6,9H,1,4-5H2,2H3
charge 0 multiplicity 1
26 atoms
S  -2.229814 1.768312 -0.073566
O  -4.155865 0.147338 0.977016
O  0.302398 0.284448 -0.295382
O  1.814763 -1.579862 -0.175883
N  -0.775674 -0.66036 0.036601
N  2.493645 0.601521 -0.745503
C  -3.192655 -0.81927 0.402036
C  -1.909122 -0.019762 0.118119
C  -3.729236 -1.511053 -0.864943
C  -4.102855 1.38547 0.244553
C  3.939532 0.312808 -0.83057
C  1.593857 -0.373902 -0.380715
C  4.684974 0.621622 0.45849
C  5.344276 -0.307541 1.192222
H  -3.012949 -1.553828 1.202395
H  -2.999919 -2.267221 -1.203095
H  -4.686085 -2.012213 -0.640398
H  -3.883384 -0.793769 -1.690317
H  -4.591243 1.327639 -0.74391
H  -4.52906 2.177038 0.874938
H  4.354607 0.907714 -1.666862
H  4.050726 -0.754963 -1.083459
H  2.149273 1.555659 -0.857779
H  4.667553 1.670527 0.790981
H  5.87223 -0.042622 2.115324
H  5.363529 -1.362928 0.894805
