program: Gaussian 09
title: 000171304
version: EM64L-G09RevD.01
frameworkgroup: C1[X(C10H11NO3)]
method: RPBEPBE
basis: SDD
operation: Freq
keyword: #p
keyword: freq=noraman
keyword: PBEPBE/SDD
title: #p freq=noraman PBEPBE/SDD
converged: YES YES NO NO
title: Mulliken charges:
elementType: O O O N C C C C C C C C C C H H H H H H H H H H H
charge: -0.247161 -0.217429 -0.167279 -0.354393 -0.111333 0.258745 0.229435 -0.516377 -0.348613 0.085012 -0.312232 -0.706204 0.058493 -0.232821 0.205787 0.255888 0.230678 0.235634 0.193430 0.258800 0.248104 0.195579 0.238863 0.340115 0.179278
chargesum: 0.00000
title: Mulliken charges with hydrogens summed into heavy atoms:
elementType: O O O N C C C C C C C C C C
charge: -0.247161 -0.217429 -0.167279 -0.014278 0.094453 0.258745 0.229435 -0.029810 0.080452 0.085012 -0.053432 -0.023659 0.058493 -0.053542
polarizability: 1.70991061e+02 7.12173736e+00 1.40466877e+02 3.38230611e+00 3.54590149e+00 6.80288262e+01
1716.lowfreq: -11.2693 -4.1128 0.0006 0.0007 0.0009 4.8546 42.1528 58.7161 74.8131
frequency: 42.1399 58.6880 74.7947 137.0832 192.6734 212.8594 223.8262 258.6781 277.6373 299.8251 333.8288 395.7892 405.2285 425.6785 444.7598 479.0923 500.1786 551.6809 596.2839 653.1645 683.1979 739.9671 751.2060 780.7632 807.9146 847.6713 891.1264 898.8381 948.2156 953.6170 1002.6465 1030.4838 1046.3652 1061.8214 1095.2576 1118.7096 1156.5186 1214.0053 1222.8006 1238.8046 1259.0869 1295.2253 1304.6207 1321.7199 1324.2515 1371.0495 1390.5731 1400.5328 1409.9827 1430.1742 1450.0844 1462.7901 1470.8238 1477.8418 1501.8009 1579.5489 1602.3800 1662.8655 2881.0480 2894.8925 2947.0669 2991.2522 2999.8255 3053.6833 3086.1941 3097.0819 3110.4811 3158.8617 3499.8059
redmass: 5.0993 3.9593 4.6383 2.8172 2.0099 4.9267 1.4276 3.8506 3.9015 2.5885 4.6664 6.8842 4.5048 4.9642 3.9734 4.4590 3.2893 4.1178 3.3306 2.5302 5.8089 2.6558 3.2115 2.2259 3.5766 3.2737 2.2791 1.4274 2.9967 1.9512 3.0857 2.2572 2.4227 2.0557 2.9025 2.8128 3.0341 1.2564 1.5610 1.4465 2.1880 2.1757 1.3872 1.7067 1.3887 1.2764 1.3540 1.7018 2.1502 1.5031 1.3782 1.0528 1.0933 1.0563 5.0592 7.2294 4.6954 6.8539 1.0816 1.0824 1.0696 1.0617 1.0357 1.0979 1.0961 1.0989 1.1012 1.0932 1.0781
irintensity: 0.8525 0.4812 14.3365 1.2059 6.0954 2.6172 4.6214 2.6085 3.2008 0.8274 3.5798 0.7229 6.2282 2.8970 7.1476 6.5546 2.4808 6.0227 24.6289 22.2403 32.3387 5.4203 8.2205 85.8711 2.8819 4.0102 5.5104 4.0584 10.8336 0.9125 0.9529 11.1928 34.9897 4.6425 36.1152 9.2144 22.2679 10.9783 58.3532 4.4274 11.4971 8.0791 34.8150 10.4150 1.3267 10.6868 24.1650 27.5290 83.9880 3.3575 1.4223 7.9545 7.3657 27.5334 134.8376 51.2805 109.6453 498.9583 100.8843 52.3329 71.6702 10.8404 17.1285 17.6297 29.9298 23.3407 24.4728 4.6855 59.2279
temp: 298.150 k
press: 1.00000 atm
elementType: 8 8 8 7 6 6 6 6 6 6 6 6 6 6 1 1 1 1 1 1 1 1 1 1 1
symmnumber: 1
zpe: 511340.0 jmol-1
zpe.correction: 0.194759 hartree
zpe.thermalcorrener: 0.207298 hartree
zpe.thermalcorrenthalpy: 0.208243 hartree
zpe.thermalcorrgfe: 0.155468 hartree
zpe.sumelectzpe: -667.038946 hartree
zpe.sumelectthermal: -667.026407 hartree
zpe.sumelectthermalent: -667.025463 hartree
zpe.sumelectthermalfe: -667.078237 hartree
dipole: -7.2420 -1.8430 -1.3695
dipole: 7.5973
quadrupole: -116.1000 -65.5388 -81.1220
quadrupole: 1.1744 2.3292 -0.1003
quadrupole: -28.5131 22.0481 6.4649 1.1744 2.3292 -0.1003
hfenergy: -667.2337052 hartree
pointgroup: C01 [X(C10H11N1O3)]
dipole: 2.8419296 -0.7655427 0.5211468 debye
dipolederiv: -0.6177863 0.0484407 -0.0242307 0.061768 -0.7970637 -0.0789202 -0.000811 -0.0906994 -0.3933601 -1.1626934 -0.3565296 -0.001706 -0.412191 -0.4469647 -0.0077255 -0.0188921 -0.0092904 -0.3394167 -1.0115031 0.4502729 -0.0455776 0.1916672 -0.425899 0.0223883 -0.0223258 0.0356244 -0.3115234 -0.7163622 -0.6296478 0.0309791 0.3116605 -0.2292924 0.0078979 -0.0468711 -0.0236848 -0.2640238 0.5237583 0.0874275 0.067182 0.068189 0.6000422 -0.0084164 0.0464032 -0.0677241 0.3933069 -0.1195369 0.0124952 0.0139595 0.3262834 -0.9285834 0.0464997 0.0662763 0.0701873 -0.1479749 0.7039698 -0.3602892 0.0557291 -0.01066 0.5786701 -0.0335996 -0.0967315 -0.0755601 -0.0060441 -0.106758 -0.0527425 -0.0157849 -0.1484852 -0.1209949 0.0139774 0.0131353 0.029085 0.0862916 0.4697187 -0.1014702 -0.0269286 -0.029186 0.4595417 0.0746153 0.0734679 0.1667216 0.4084155 -0.9148132 0.3157872 -0.0501694 -0.0579379 -0.7159799 0.0575937 -0.0327586 0.1154933 -0.0360707 0.2059172 0.7962657 -0.0483096 -0.0034856 0.5598005 -0.038305 0.0108728 0.0017077 -0.0025816 -0.0769652 0.0723958 0.0374856 0.0054333 -0.038266 -0.0657465 0.0147738 -0.0671258 0.0260942 1.531257 0.4276755 0.0051646 0.27752 0.4546375 -0.0045155 0.0582891 -0.0160905 0.1914097 1.13179 -0.5310513 0.0294165 -0.4717968 1.0088546 -0.1646755 0.05011 -0.1826071 0.1186414 -0.098987 -0.0289936 -0.0468848 -0.034751 -0.0215567 -0.0232344 -0.086158 0.0571446 -0.1853516 0.050143 -0.0207723 -0.0211067 -0.042109 0.0375055 0.041774 -0.0403399 0.0549763 -0.0547756 -0.0220997 0.0870616 0.0626973 0.0295415 -0.0023164 -0.0572279 0.0434014 -0.0796289 0.0359213 -0.0032463 -0.0817367 0.0114552 -0.0842183 -0.1233323 -0.0001176 0.0340382 0.0447137 0.0848835 0.0103889 0.0507075 0.0014126 0.0612832 0.0389176 0.0727917 -0.0476343 -0.0654759 -0.2121649 0.0413085 0.0798654 -0.0166986 0.0697663 0.0092375 0.0073984 -0.0072852 0.0056756 0.1544232 -0.1564097 -0.0086167 0.0003392 -0.0553403 0.1076023 -0.0039954 -0.0047259 -0.0180179 0.0972238 0.1212482 -0.0726042 0.0302358 -0.0143937 -0.1262758 0.0524301 0.0237589 0.0763934 0.0465511 0.089215 0.0059159 -0.0849907 0.0141597 0.0848156 0.0247964 -0.0458813 -0.0112896 -0.0939432 0.1427004 -0.0091899 -0.0066307 0.0272718 0.233443 0.0066244 -0.0105678 0.0023559 0.3188727 -0.0142539 -0.1806669 0.0429618 -0.0799889 -0.1965429 0.0576924 0.0264555 0.0471156 0.0851957 unknown
polarizability: 170.8342947|-7.5340225|140.7161244|2.9322207|-2.7224242|67.9363459 unknown
InChI: InChI=1S/C10H11NO3/c1-6-8-4-11-10(13)9(5-12)7(8)2-3-14-6/h4-6,11H,2-3H2,1H3
charge 0 multiplicity 1
25 atoms
O  2.914712 0.896285 -0.234972
O  -3.148558 -1.324788 0.018755
O  -3.479745 1.520328 -0.18856
N  -0.950933 -2.04695 0.154958
C  2.494722 -0.438733 0.222921
C  0.968022 -0.594526 0.146245
C  0.076548 0.535741 0.042921
C  0.691837 1.936677 0.009372
C  2.159332 1.937777 0.469873
C  -1.328387 0.351432 -0.028674
C  0.404162 -1.866349 0.203123
C  3.27935 -1.434698 -0.64285
C  -1.930933 -0.994156 0.04523
C  -2.219602 1.521829 -0.215816
H  2.811317 -0.54503 1.288055
H  0.645689 2.324669 -1.026824
H  0.116746 2.635571 0.643085
H  2.653356 2.889167 0.215391
H  2.229721 1.7791 1.568707
H  1.012894 -2.770583 0.291207
H  4.351509 -1.180061 -0.594969
H  3.160117 -2.47285 -0.286086
H  2.95066 -1.375462 -1.694022
H  -1.360395 -2.986794 0.198713
H  -1.682443 2.479903 -0.421283
