program: Gaussian 09
title: 000171506
version: EM64L-G09RevD.01
frameworkgroup: C1[X(C26H28N2O4)]
method: RPBEPBE
basis: SDD
operation: Freq
keyword: #p
keyword: freq=noraman
keyword: PBEPBE/SDD
title: #p freq=noraman PBEPBE/SDD
converged: YES YES NO NO
title: Mulliken charges:
elementType: O O O O N N C C C C C C C C C C C C C C C C C C C C C C C C C C H H H H H H H H H H H H H H H H H H H H H H H H H H H H
charge: -0.256327 -0.258934 -0.202535 -0.208755 -0.079054 -0.016817 -0.422094 -0.329045 0.189739 -0.307015 0.297804 0.269701 0.104981 0.344808 -0.390827 -0.355091 -0.358031 -0.386135 0.324024 -0.626996 -0.613897 -0.374536 -0.385111 -0.361269 -0.358464 0.311081 -0.371522 -0.386857 -0.237007 -0.232713 -0.244775 -0.537604 0.237466 0.225572 0.172144 0.203372 0.212399 0.202824 0.254916 0.255323 0.249498 0.255291 0.221922 0.184558 0.241029 0.186105 0.224580 0.224747 0.265175 0.259944 0.253876 0.244490 0.247679 0.250986 0.228338 0.228073 0.229722 0.224284 0.226213 0.248748
chargesum: 0.00000
title: Mulliken charges with hydrogens summed into heavy atoms:
elementType: O O O O N N C C C C C C C C C C C C C C C C C C C C C C C C C C
charge: -0.256327 -0.258934 -0.202535 -0.208755 -0.079054 -0.016817 0.040943 0.046471 0.189739 0.108208 0.297804 0.269701 0.104981 0.344808 -0.135911 -0.099768 -0.108533 -0.130844 0.324024 0.020513 0.021536 -0.109361 -0.125168 -0.107392 -0.113974 0.311081 -0.123844 -0.135871 -0.008669 -0.004640 -0.015053 0.161641
polarizability: 5.14979555e+02 5.75594431e+00 3.68501910e+02 6.89105588e+00 5.65325479e+00 2.21446293e+02
1716.lowfreq: -28.5275 -2.7171 -0.0011 0.0006 0.0009 3.8584 6.8326 12.6410 22.4296
frequency: -27.5622 12.5322 22.4067 31.6646 34.0518 44.7067 46.5499 50.4925 63.1671 73.4705 81.5428 85.5684 102.1691 110.2554 120.6833 139.2617 148.5898 163.5843 165.6615 180.4560 184.8449 209.0393 222.4876 232.3254 235.7875 238.8907 267.7095 290.8090 299.3686 319.5735 325.2347 345.6251 356.4998 364.7870 403.7634 413.8055 419.9408 426.4370 449.8029 461.8507 465.2049 490.9368 507.8955 517.5907 539.1219 558.0429 595.9461 614.7444 619.6981 629.6370 641.2922 666.8629 683.2405 697.8817 716.3525 731.2662 748.1901 765.3376 773.1359 775.9307 789.0751 813.6872 818.2430 818.9567 832.9870 843.0065 850.4106 857.8364 880.2845 884.1689 925.4849 950.7911 954.3665 969.6392 971.9614 974.1748 978.6544 981.6307 984.1965 989.6933 995.5467 1001.4657 1007.0521 1025.6701 1031.8286 1033.8922 1068.2442 1086.0138 1087.3206 1091.4616 1098.1988 1112.0027 1117.8945 1125.0614 1141.1646 1156.1029 1161.5010 1173.5043 1173.9604 1177.2191 1180.5495 1192.5418 1196.5192 1218.6443 1235.5573 1239.7734 1253.8486 1262.5649 1279.6990 1289.3420 1298.5478 1299.0857 1309.2767 1311.6805 1325.5985 1348.5389 1359.8705 1363.9170 1375.4870 1376.4036 1386.5243 1417.9792 1425.3722 1429.7793 1436.0283 1437.1414 1442.5062 1460.2481 1462.3814 1467.5430 1471.6629 1473.4721 1474.9161 1478.5358 1478.8357 1484.2286 1489.2600 1498.0912 1502.0479 1547.6625 1564.9208 1570.8218 1582.4807 1608.0779 1613.5784 1619.6469 2807.9380 2841.8904 2858.4696 2947.6992 2965.3828 2996.2506 3007.6638 3013.1995 3018.8170 3032.8283 3055.8225 3077.4769 3081.2078 3090.4051 3125.7313 3130.2096 3132.2440 3135.8119 3141.3097 3143.4997 3144.4601 3146.5892 3154.6747 3166.3785 3167.3392 3167.8261 3170.4284 3171.6607
redmass: 2.4527 5.1413 5.3645 5.7506 5.6131 4.1033 4.8330 4.7169 4.4863 3.9946 6.0365 3.8464 3.9695 5.5070 2.2567 2.9244 2.8686 4.1043 4.4225 7.2191 4.0048 3.1129 1.6557 1.3165 1.5217 1.6998 3.7462 6.1896 3.7508 4.5957 2.5577 4.2803 5.3313 5.7386 2.8318 2.9825 2.9934 2.4985 4.8431 3.5401 4.9850 3.6068 3.2757 3.4476 3.7593 4.4367 5.0523 6.3401 6.6351 7.0061 7.1256 6.3984 5.8782 1.7108 6.6846 4.1875 4.3362 3.8263 3.0255 1.3670 2.7975 1.4911 1.3322 3.3497 2.0763 1.6127 1.2583 2.9668 4.9418 1.3119 1.4638 1.4108 1.4095 5.2317 1.3534 1.6052 1.4750 3.4227 7.4781 5.6100 1.3594 2.7797 2.4905 2.5140 2.0886 1.5491 2.4261 2.5058 1.6585 1.4255 1.5220 1.2589 1.3671 1.3408 1.5283 1.5372 2.5205 1.4665 1.0699 2.6731 1.4106 1.7820 1.1435 1.7747 2.6211 3.0058 4.0467 2.3544 1.1830 1.2097 1.4631 1.8484 1.2978 1.8528 1.5489 8.2813 5.4115 3.9179 2.3006 2.3940 1.5443 1.1449 3.7040 3.9622 2.3430 1.2091 1.1692 1.0603 1.0603 1.0512 1.0995 1.1437 1.0645 2.0291 1.0548 1.0914 1.1536 2.1949 2.3438 8.9384 6.9246 7.4287 5.9586 5.9565 6.1260 6.3715 1.0707 1.0575 1.0575 1.0554 1.0327 1.0848 1.1048 1.0621 1.0718 1.0715 1.1042 1.1014 1.1040 1.1005 1.0848 1.0998 1.0880 1.0898 1.0884 1.0886 1.0927 1.0879 1.0962 1.0948 1.1013 1.0955 1.0960 1.0966
irintensity: 0.5158 0.4326 0.6049 0.8380 0.8920 0.8150 0.6027 0.8858 0.2608 1.0971 0.6624 0.6211 2.7160 1.4861 0.0721 0.6184 3.0604 2.7545 2.6646 6.3283 1.5865 1.1959 0.1353 0.1860 1.4438 0.4708 1.6187 1.4946 2.4360 5.3917 9.7172 0.6314 5.5819 0.3573 0.1942 2.3464 2.4018 1.9254 2.3260 0.8101 4.7354 3.0021 8.8939 8.0899 25.5139 37.4698 42.9491 1.1569 6.6248 0.3614 4.6139 0.9381 2.0373 44.9156 17.6009 0.7794 3.9980 26.2488 21.4623 6.8369 12.1347 19.3390 20.4361 8.8014 19.7740 65.7953 0.3060 17.8459 14.5722 2.4901 1.1754 1.9690 0.6307 118.6386 3.2389 27.7963 1.4126 42.2724 41.2911 1.6810 0.6905 5.0420 29.7144 4.1621 1.5670 17.0340 10.0307 25.6283 12.3967 9.8775 8.3777 0.1879 15.4478 10.5295 5.8677 5.2231 61.0411 57.7835 3.7683 333.4849 369.6338 51.1125 5.5114 8.6567 334.8560 172.6724 62.1942 0.5491 0.2153 0.8939 28.9935 58.3780 4.0965 52.7822 26.9964 126.3698 53.7806 2.2554 0.5508 1.2178 51.9396 2.4481 0.3307 16.6088 11.6186 10.9651 3.1046 9.8334 18.8592 15.5270 66.5150 46.4810 3.2789 3.2686 15.6637 1.8017 59.8179 52.6003 83.3163 74.0196 16.1809 53.0181 14.6371 22.7025 309.4495 116.3393 83.3618 71.9091 227.0131 39.1930 75.2020 21.7710 22.6839 25.6306 47.2460 44.5844 39.9349 24.8892 48.6799 47.1757 2.4624 26.2882 1.5649 3.0379 14.4841 2.2002 17.9061 5.1558 28.7883 15.5318 27.6850 9.0421 7.3968 5.8809
temp: 298.150 k
press: 1.00000 atm
elementType: 8 8 8 8 7 7 6 6 6 6 6 6 6 6 6 6 6 6 6 6 6 6 6 6 6 6 6 6 6 6 6 6 1 1 1 1 1 1 1 1 1 1 1 1 1 1 1 1 1 1 1 1 1 1 1 1 1 1 1 1
symmnumber: 1
zpe: 1263570.3 jmol-1
zpe.correction: 0.481269 hartree
zpe.thermalcorrener: 0.511589 hartree
zpe.thermalcorrenthalpy: 0.512533 hartree
zpe.thermalcorrgfe: 0.416781 hartree
zpe.sumelectzpe: -1415.501644 hartree
zpe.sumelectthermal: -1415.471324 hartree
zpe.sumelectthermalent: -1415.470379 hartree
zpe.sumelectthermalfe: -1415.566131 hartree
dipole: -0.6490 7.5382 -0.0306
dipole: 7.5661
quadrupole: -135.2638 -197.6019 -185.3547
quadrupole: -4.1418 8.4830 -9.6549
quadrupole: 37.4764 -24.8618 -12.6146 -4.1418 8.4830 -9.6549
hfenergy: -1415.9829126 hartree
pointgroup: C01 [X(C26H28N2O4)]
dipole: 0.4021268 2.9033985 0.5192207 debye
polarizability: 513.7820158|-14.5860338|367.2373193|8.646418|18.9208624|223.9084232 unknown
InChI: InChI=1S/C26H28N2O4/c1-27(2)18-7-19-32-24-16-12-21(13-17-24)25(20-10-14-23(31-3)15-11-20)26(28(29)30)22-8-5-4-6-9-22/h4-6,8-17H,7,18-19H2,1-3H3
charge 0 multiplicity 1
60 atoms
O  -4.292525 -0.581612 -0.579605
O  3.939358 4.480013 0.749706
O  0.560726 -3.159199 1.325051
O  1.675079 -4.09452 -0.432422
N  -9.010917 0.482912 0.390869
N  1.390572 -3.088543 0.335399
C  -6.607546 -0.021517 -0.178331
C  -7.602967 0.917854 0.536907
C  1.39446 -0.620104 0.122538
C  -5.167227 0.282579 0.238419
C  -0.083257 -0.592552 -0.039952
C  2.090548 0.685186 0.288089
C  2.115743 -1.808873 0.101182
C  -2.914491 -0.525463 -0.353797
C  -0.883111 0.303279 0.717779
C  -0.73851 -1.439209 -0.983202
C  -2.284302 0.338707 0.578938
C  -2.130187 -1.408154 -1.141587
C  3.564881 -1.986102 -0.167776
C  -9.489832 0.50491 -1.006453
C  -9.9108 1.235471 1.289246
C  1.6791 1.835494 -0.449125
C  3.152022 0.839054 1.220568
C  2.315728 3.074598 -0.280942
C  3.791121 2.0785 1.41301
C  3.377364 3.203066 0.652066
C  4.331088 -2.937214 0.56149
C  4.211317 -1.220665 -1.176322
C  5.707004 -3.101425 0.303965
C  5.587526 -1.385876 -1.433015
C  6.343907 -2.324488 -0.692163
C  5.044952 4.670311 1.695075
H  -6.855243 -1.06747 0.076834
H  -6.680556 0.082092 -1.276161
H  -7.452454 1.968837 0.166186
H  -7.374874 0.926055 1.62184
H  -5.005821 0.057579 1.312944
H  -4.910747 1.347506 0.05407
H  -0.402236 0.962799 1.4479
H  -0.145154 -2.118356 -1.605678
H  -2.867775 1.027389 1.196108
H  -2.635265 -2.053886 -1.865805
H  -10.536827 0.155122 -1.038491
H  -9.450964 1.52528 -1.469278
H  -8.890207 -0.178634 -1.630333
H  -9.963439 2.329979 1.054552
H  -10.93343 0.823809 1.219158
H  -9.57062 1.126227 2.33474
H  0.858801 1.745475 -1.168963
H  3.468647 -0.024027 1.814867
H  2.01257 3.955225 -0.854932
H  4.594607 2.158732 2.150752
H  3.847991 -3.551542 1.329837
H  3.627697 -0.504168 -1.76359
H  6.281654 -3.838581 0.875495
H  6.067156 -0.792158 -2.219086
H  7.412337 -2.456906 -0.895737
H  4.722671 4.467616 2.734549
H  5.907042 4.025098 1.438843
H  5.328415 5.727787 1.593577
